##TITLE= ACET.SPOROPO.TYPHA/CH-CORR
##JCAMP-DX= 6.00   $$ ISAS JCAMP-DX program (Version 2.0 beta)
##DATA TYPE= NMR FID     
##DATA CLASS= NTUPLES
##NUM DIM= 2
##ORIGIN= Dr. J. Lambert, ISAS Dortmund, Germany
##OWNER= COPYRIGHT (C) 1999 by ISAS Dortmund, Germany
##.SOLVENT NAME= CDCL3
##SPECTROMETER/DATA SYSTEM= JEOL GX 400
##.FIELD= 9.1
##.OBSERVE FREQUENCY=  100.40
##.OBSERVE NUCLEUS= ^13C  
##.PULSE SEQUENCE= HETCOR
s1=        0.0
s3=        0.0	
s4=       14
p1=       10.500
p2=       21.000
p3=       28.700
rd=     1000.000
id1=       0.114
d1=        0.114
d2=       10.000
NS=       2720
##.DELAY= (   19.8,   19.8)
##.ACQUISITION MODE= SIMULTANEOUS
##.ACQUISITION SCHEME= NOT PHASE SENSITIVE
##.DIGITISER RES= 16
##RESOLUTION=    5.87
##DATA PROCESSING= Ordinates are scaled between -32767 and +32767.
##NTUPLES= nD NMR FID     
##VAR_NAME= TIME1,         TIME2,         FID/REAL,        FID/IMAG         
##SYMBOL=   T1,            T2,            R,               I
##.NUCLEUS= 1H,            13C            
##VAR_TYPE= INDEPENDENT,   INDEPENDENT,   DEPENDENT,       DEPENDENT
##VAR_FORM= AFFN,          ASDF,          ASDF,            ASDF
##VAR_DIM=           64,       1024,       1024,       1024
##UNITS=    SECONDS,       SECONDS,       ARBITRARY UNITS, ARBITRARY UNITS
##FIRST=     0.1144165E-03,  0.000000    , ,
##LAST=      0.7322654E-02, 0.4255673E-01, ,
##MIN=       0.1144165E-03,  0.000000    ,    -669731,    -694236
##MAX=       0.7322654E-02, 0.4255673E-01,     773095,     691948
##FACTOR=     1.000000    , 0.4159993E-04,  23.59371    ,  21.18705    
##PAGE= T1=  0.1144165E-03
##FIRST=  0.1144165E-03,  0.000000    ,      13165,       2733
##DATA TABLE= (T2++(R..R)), PROFILE   $$ Real data points
$$ [...]
##PAGE= T1=  0.1258581E-02
##FIRST=  0.1144165E-03,  0.000000    ,      18733,      -9577
##DATA TABLE= (T2++(R..R)), PROFILE   $$ Real data points
495 1708 -961 7200 1236 -744 3156 4219 -3788 1139 858 -1560 -7698 -1616 4841 1174 -1275 2348 36
512 36 8107 -8036 -3813 5961 648 -8697 5629 -56 -1274 -3668 -3865 4859 -1459 -4443 -1945 9065 -8346
529 -8346 -2939 2976 5447 -1800 808 958 -809 -7170 -5612 3040 2134 -5578 -2978 1623 -3056 -2284 220 -3313
547 -3313 9722 1990 -6862 3037 3441 -1932 -1444 -1122 2124 494 -1392 1209 4419 4210 -6071 4346 -219
564 -219 -7150 -4081 -2396 1335 -3080 -833 182 396 -3519 -138 2569 3575 -6188 3004 -1185 1376 -4568
581 -4568 -3163 -30 -5029 2891 5608 1910 1471 334 1501 6990 -6046 2390 -705 -695 3719 -3841 -4018 -1297
599 -1297 -4690 -4225 3553 5648 -5633 -3007 2596 3423 -292 -4535 3000 9736 -1197 -5162 1085 -1345 -6539
616 -6539 -2075 1248 6074 4630 -4737 4421 -600 -5835 -2290 -707 -4292 1029 -1929 -140 4010 -7291 -5000
633 -5000 1514 3790 -6448 3190 12627 -7022 18 -346 1859 2298 -5603 -2279 6519 -683 -5327 2894 2951
650 2951 5509 -4563 452 908 -3254 -7099 988 -2200 -6630 1726 7578 3633 1314 -2324 -5517 1316 -3071
667 -3071 -5939 -76 4681 -1568 -3954 5705 -5314 4858 -3962 147 8421 1888 80 -1088 3479 -4427
683 -4427 -1802 4221 -4169 665 2514 -1701 10523 -2761 -3959 5179 4390 659 -927 -6733 897 -272 -5336
700 -5336 8760 546 1211 2377 2498 879 -916 -2575 669 2761 -2077 3384 388 6671 -3335 -2045 2682
717 2682 1983 -5398 -4218 5725 -151 -3224 -989 772 -2096 -837 -64 1127 3345 -1621 484 615 -2059 -1281
735 -1281 -1839 7692 3432 -4151 -81 2438 -2259 1386 5220 -102 -5586 434 1061 -47 5127 1196 3429
752 3429 8584 1662 -5944 -294 1358 -508 -2153 1275 4003 -3063 1522 -559 2820 -5 -5501 5135 631
769 631 -4577 736 -1719 4543 4396 -5778 1075 4108 -1487 1498 -232 6158 -1744 773 -6098 -460 3733
786 3733 -2251 -1456 -2423 1121 6222 1067 3259 -3127 826 -3443 -5687 3910 3737 -1657 -2855 3250 -1188 -7562
804 -7562 105 -607 -680 3527 -1174 1608 2404 -1650 1791 5611 -2495 -3358 495 -3862 -1027 -2772 3486 2885
822 2885 -489 -3147 432 -2311 1309 -4772 2919 2252 541 -609 -4288 6540 -8066 1604 1816 2631 -8035
839 -8035 4831 126 -5018 4835 2753 -2171 1261 1424 5441 -2788 610 -5046 446 -623 4705 -2350 -5876
856 -5876 2438 -2034 -2309 -3439 138 1110 -1156 -3726 5264 -2844 1325 -7300 4434 11888 -5682 -4803 -976
873 -976 -7700 -2890 4563 -1602 8421 -2852 -1169 1229 427 -8988 -513 890 -2768 -4892 4879 1295 -826
890 -826 -9579 6362 63 -1784 -6718 6922 222 -2701 -2392 -5102 -474 -123 -10015 4386 4273 -737 848
907 848 -276 -98 -6958 -2920 5458 2729 -1671 -3717 2290 6718 1142 -4579 2464 6895 -5665 -3614 -3172
924 -3172 4641 1032 -4785 5840 6584 -7061 -273 1391 -1452 -912 1301 8077 4946 -5670 -7385 4721
940 4721 1308 -5903 -3111 948 1187 -2107 -6969 15514 3022 -7854 794 3304 -790 -2830 -920 1332
956 1332 2618 -2898 -4666 3677 5185 -1327 7520 5519 -2762 -9173 -3430 3729 6928 -2614 4527 5338 -4015
973 -4015 -6316 10948 8059 -1338 -5118 2305 5692 -1054 -629 -3902 5443 -4294 -7411 10762 11622 -525 -3724
990 -3724 8656 3488 1924 -4238 1005 8453 -5943 -5636 6257 5849 -7842 -1952 6738 3666 -5165 -578
1006 -578 815 2289 -4646 -7152 8433 -8837 -7985 2317 365 1991 -6450 -4241 -301 6347 -12438 224
1022 224 13085
1023 13085
##PAGE= T1=  0.1258581E-02
##FIRST=  0.1144165E-03,  0.000000    ,      18733,      -9577
##DATA TABLE= (T2++(I..I)), PROFILE   $$ Imaginary data points
0 -452 -15786 -2790 5256 4816 8098 -11043 -12927 27345 -10117 -27218 24014 11205 -13807 -1321 2048
15 2048 2492 5702 -16364 3461 29686 -8981 -10216 20483 -3132 -9463 -575 1150 3870 -8769 -22139
30 -22139 10620 6162 -20343 -682 18374 -2907 -11084 1932 4364 8616 -7184 -12451 23978 5426 -15920
45 -15920 -2224 12045 -990 -10112 -5363 6179 11223 -7453 -2403 14152 -7393 -12356 6952 5281 1622
60 1622 -13452 1998 8844 5375 -16016 -1859 20324 -10599 -12762 -2062 14178 6186 -14408 4559 15155
75 15155 -8195 -11498 6503 9248 5038 -11562 851 14298 -5198 -10667 3706 13882 -7628 -6693 2654
90 2654 13513 -9607 -3740 6003 16956 -16139 -6662 10390 5962 -6806 -6367 5180 12721 -12926 -13919 14289
106 14289 7343 -15987 -1167 9032 6025 -5899 -139 2314 13338 -18360 -15948 14347 918 -11014
120 -11014 186 5961 351 -6831 -11408 12510 14739 -21104 2814 8874 -10621 -13081 5282 -1824 694
135 694 -3526 -8518 18714 751 -16930 6203 10474 -6081 -11551 1713 5062 4585 -11362 3910 13428
150 13428 -10887 -19554 19154 8593 -3745 2842 405 620 8093 -612 6778 9350 -8172 -8608 9249 -2496
166 -2496 -5701 -4561 -219 5889 -3036 -12617 6321 8726 -3722 -11742 9147 -287 -6757 -7672 3580 5869
182 5869 -6480 -4104 5549 5490 -15889 -10771 5169 480 -7200 -2825 9672 -1328 -8029 -3732 10039 -4558
198 -4558 -7569 -1383 11727 -1488 -8905 -82 7752 2785 433 4738 9287 2180 -4171 6868 15493 -2785
214 -2785 -15834 3018 7261 -14355 3557 1962 2493 -8246 -9633 6940 9752 777 1353 5316 401 1137
230 1137 5835 -8156 9995 5291 -11001 6610 7269 -7499 -2029 5751 1836 -1552 -8602 -4181 11226 -7443
246 -7443 -12559 12474 -775 -7875 882 -552 1426 -3304 -1237 1691 8920 -6702 -855 12724 -762 -3281
262 -3281 2177 5779 3813 -6889 -4993 8554 10701 -5922 -1359 5784 -6796 -2551 -8774 -4670 4506 -3408
278 -3408 -6811 4639 -4717 -6363 -37 1533 1177 4509 -4008 779 9208 -11197 -1653 9885 -1584 -9113
294 -9113 7157 1192 -909 2610 -5909 3905 767 -7538 2093 13810 -8695 -3268 -1642 3841 4812 -1215
310 -1215 -2720 2382 -4457 -6962 -1699 7365 -1679 -935 5475 645 -4964 4079 -1375 3730 4020 -1758 2939
327 2939 6731 -3402 -2577 2416 -1833 -2507 1225 -980 393 481 -952 -1593 2110 4820 2364 1628 -1557 3283
345 3283 5071 2408 5357 -7077 -3148 8883 617 1355 2769 3318 -5016 -6341 118 -7643 -3085 433 -2111
362 -2111 2468 946 -3844 1778 5289 -4279 -4255 -6362 2171 455 939 3746 -759 4804 1725 -719 -301 -2374
380 -2374 -9365 351 -6954 -2191 882 3556 -2710 -400 645 -6445 307 3041 3525 -1526 546 2682 985
397 985 -3154 4163 1058 361 1687 2800 2581 2064 -6315 -2193 5458 1172 1139 3874 -2994 -4049 2453 445
415 445 3318 -4475 3119 -4089 -435 1978 -1848 -2216 4188 -901 -1810 -1862 -3433 1649 -921 -2838 -1710 -2603
433 -2603 -7208 1790 2216 -3398 -10775 -5874 1861 1722 -3730 -3545 -1888 -1305 -6712 -8371 -1858 5975 -1168 -1678
451 -1678 6658 -3659 -776 -6257 -2855 1186 -1562 2786 2656 -5762 805 2307 948 -6370 -3570 8925 4265
468 4265 7453 -3900 -683 -4619 -5038 -2007 -1300 5046 2039 -6004 -420 1171 -1820 -7825 7156 168 -19368
485 -19368 7069 3011 -2648 -2360 -792 -3533 4549 -2585 3663 9019 2272 -9179 -1175 2540 -741 -4339
501 -4339 1250 4463 2156 -3582 22 2388 25 -7072 -177 3220 9081 -5783 -4698 7680 4581 -5048
517 -5048 4465 275 -751 -6384 1517 5155 4774 -1766 -1168 443 -3402 -8357 4943 1849 -528 7132 -2008
534 -2008 5414 -2443 -250 1113 310 -4132 -3113 6708 1143 -2830 1844 -1432 -1665 2921 -5208 764 934 -4746
552 -4746 -10484 2562 2352 4194 -5544 2326 4702 -3980 -2767 10462 4391 -748 393 6364 3043 -13663
568 -13663 1613 4337 5876 -6269 2736 -175 -4742 -12901 -8101 183 -3794 1430 -2190 243 2 -582 -186
585 -186 608 -3248 1225 381 6888 2266 -5257 4925 6225 955 -1623 1511 5480 -2252 -1337 41 2633 -4114
603 -4114 -929 -3946 -686 1642 -1566 1854 5494 -9195 -169 684 5350 -276 -5424 1700 -206 -2940 -2606
620 -2606 1234 -125 -2001 -10095 1428 -226 -7389 1938 -1929 -1897 -4433 -3138 1349 4549 -6375 5284 1366
637 1366 -4399 -6381 -1100 -11 3619 -3724 -7125 7577 7712 -6507 2676 4303 2515 2543 5241 -9106 4447
654 4447 -96 -7010 10814 824 -4649 -4124 7053 -285 2648 1 4259 3573 -12018 -5345 -3149 -8353 -1198
671 -1198 2448 -4507 2841 1531 -2608 6671 520 -7022 -414 6279 -1401 -676 -3893 -7322 7546 -6242 644
688 644 9468 4496 -1631 6112 5052 -2334 8310 4956 7467 -4435 788 8816 5154 -2679 -4045 8986
704 8986 288 2834 2238 5526 3116 -3862 -1938 1901 1701 -5069 7263 2834 1484 -3145 -2136 -3413 135
721 135 2925 -1143 -1222 1818 -1907 -2558 11708 -8097 302 496 1810 1702 -3633 1792 339 8494 -7414 3146
739 3146 3833 -720 -811 8906 1094 3617 -1928 -7510 -1399 4481 -5796 -414 1883 -291 960 2131 -1944
756 -1944 -1423 -839 -5572 -3192 2240 1188 559 -1641 766 -6933 1859 -10295 -1007 -1010 2443 -1844 2488 931
774 931 -5355 4165 1074 5597 -6109 -3212 8950 -954 2710 714 707 510 2694 -4926 -3762 1010 2319 -1221
792 -1221 1377 -4385 2905 3696 952 3476 -1376 5449 1013 -1914 -3460 721 1927 10240 -1577 -4388 7439
809 7439 1552 3262 -5028 3134 -1561 1706 -876 -894 -1949 779 -2003 4756 5216 -167 -3258 218 -3297 68
827 68 662 7041 -1979 3406 3778 -2385 2100 -4282 -6767 -68 -2734 2276 853 2264 -1702 2974 -1650 5901
845 5901 1411 2873 2223 -8464 -5034 3275 4164 2859 -2884 4178 3769 -488 -5940 3212 806 -6760 -3429
862 -3429 -5897 1347 4890 -3970 -2768 2400 9971 -12956 -5759 7245 -3527 -7076 -4916 3373 4984 -4657
878 -4657 7894 -4304 -2776 -4586 -334 -5580 -3129 -4097 1640 506 4443 -770 -289 4219 -2208 -6670 -4974
895 -4974 5437 -5794 376 -6204 -1378 3889 -5933 279 4900 -1281 -12899 7554 4978 -2362 5504 1585
911 1585 4840 3752 -9454 2024 6459 -11471 -4686 6392 -3788 -2951 7239 -3306 9585 -1789 -3988
926 -3988 3208 1018 -2677 3769 -3380 2177 694 -5526 2031 3170 3997 -588 8502 320 -5657 6922 -3200
943 -3200 1348 -3780 3277 2990 3090 -3980 -2311 8226 2410 -4140 4150 138 -1744 -2573 -6184 2921 3031 -9339
961 -9339 2494 14120 -1440 -3448 8693 7510 -2629 -7428 -2151 7043 2253 -5854 3346 13494 -3337
976 -3337 -3550 4381 12075 1230 166 8195 8681 -1177 -9445 8240 5909 -5214 -4175 2903 202 -10137
992 -10137 -12414 1212 11644 -5014 -8327 6984 4020 -17928 -3009 6957 1176 -2519 -8052 5166 7621
1007 7621 -8038 -3012 4622 9452 -6221 -4681 -237 1998 1200 1297 -1684 7179 -7824 -4701 11312 3482
1023 3482
##PAGE= T1=  0.1372998E-02
##FIRST=  0.1144165E-03,  0.000000    ,      -9437,       7818
##DATA TABLE= (T2++(R..R)), PROFILE   $$ Real data points
0 -400 2135 3498 -16145 -2741 14238 -9416 -7322 15083 -4262 -4726 -4948 38 14370 3308 -23464 6646
16 6646 20575 -12930 -5064 8316 -4877 -4496 -3904 -5454 5233 -4013 -17910 11394 6792 -18521 -3661
31 -3661 8191 -7134 -2956 -3679 8040 13512 -8445 -18586 14352 4780 -15473 4546 11713 2723 2644 -9389
47 -9389 5039 1426 -6570 -12625 20945 1509 -20275 4863 7735 -1468 -4999 -5906 2350 6899 -15063 -4400
63 -4400 11429 -2306 -10011 7896 15231 -5663 -2370 -5193 7212 5079 -13338 -2997 14566 -6797 -6013
78 -6013 9924 5831 -1416 -670 -7571 8713 -2915 -24238 11662 5251 -13713 3127 13964 433 -2417
93 -2417 -9346 -2716 18982 -3775 -14085 14076 7919 -19855 5255 9055 -4881 3574 -10881 -3960 18321
108 18321 -9457 -11776 19033 1588 -19178 712 4594 -5064 7701 -8015 3099 4014 -10790 -7669 19732
123 19732 1554 -12447 5894 3813 696 -650 3 6885 -1197 -14499 6489 18029 -3646 -9304 9639
138 9639 5040 -3779 -1100 -5625 16877 -116 -16533 1576 9140 -6321 -5284 4297 2981 1447 -1622 -6987
154 -6987 12599 -5348 -10498 4699 7480 -8164 -1787 2731 690 -1825 -6230 -4013 12937 -6725 -13401
169 -13401 10795 -3476 -9095 489 -2456 408 -4774 -8096 5614 13156 -11124 351 12300 1357 -4439
184 -4439 -2733 3775 3990 -2514 -2292 4576 13321 -13648 -5377 15663 4057 -1900 -4889 7657 2594 -2844
200 -2844 -3242 436 -5474 -6330 -10435 9539 -4415 -2130 -1606 2295 463 -9158 1689 8135 -11077 -6814 -4457
217 -4457 9508 -2529 -10790 -1260 1360 1228 -5378 -8675 3727 -3447 -9359 2554 5358 -362 -4414 5128
233 5128 -46 1028 -6724 6178 7801 189 -6335 4253 9208 -940 -3374 2567 -1881 1074 -6683 2080
249 2080 8413 1360 -8833 5757 2202 -4128 109 4994 598 2084 -6137 4393 8355 -4358 -4098 12814
265 12814 770 -6569 1584 4822 3010 2872 -11480 619 5711 -8467 -6357 9371 -2583 1596 -1662
280 -1662 2184 5645 -4728 -6696 7523 1230 -11310 6854 -498 -2943 -4275 5789 2887 3186 -7035 -1333
296 -1333 3665 6846 -2240 4576 5320 -7151 979 -4863 5011 131 -7927 -1997 5722 -4163 -3398 898 -2760
313 -2760 -1596 -1265 -3175 -850 2207 -3250 -264 1163 -3482 -1252 2585 -2047 1796 3604 6476 8757 4213
330 4213 -2034 756 161 -5011 -1873 1083 886 -1775 -4999 -1122 -2364 2275 -2106 -4478 -240 54 -1524 928
348 928 -4073 1364 2352 2723 -739 -847 -154 3083 1311 -3744 2041 5939 737 407 2964 4284 -2723 4744
366 4744 3341 -452 3699 5267 316 -730 -5663 -4391 157 2325 -415 469 -798 477 -4648 4377 4198
383 4198 2862 -3522 -747 4359 -7190 903 936 1501 -1062 -2096 -3094 4251 4360 -2825 -4376 -2527 889 -419
401 -419 -2704 500 2305 -1457 4566 -6550 -907 3632 1931 3458 -951 1929 -3017 2756 4428 2844 95
418 95 3104 7447 -2467 423 -5093 -5899 2727 3918 966 1889 2236 1954 2972 -1091 3835 1846 838 1456 -501
437 -501 561 -7238 -5344 1625 -2931 1378 9663 -1360 -1368 8071 3427 2187 1323 -1266 4625 1342 -1295 -1162
455 -1162 4424 2820 -4549 -164 3066 334 -1277 -2663 4406 -447 -3333 -2922 1547 -2236 -1535 -1606 6127 6956
473 6956 2357 1695 6309 13271 -6428 -1818 2109 -384 -1560 4982 1428 2893 -2217 -5925 3766 -4307 -3752
490 -3752 113 2172 1879 601 3067 -563 1167 -1626 -1648 8679 3848 -6397 -2776 3949 7209 4843 -1950
507 -1950 4655 -6290 -7792 -542 5112 -665 2630 7520 2397 2134 -8543 -1672 7548 -10611 -10294 1776
523 1776 5206 -1621 1268 659 1161 5867 -7442 -3572 6902 2866 -2490 5258 2309 -4648 -154 5351 -840
540 -840 1312 -4186 -1836 5968 -4199 3434 6226 -2511 -110 -3042 4243 -1466 -6570 897 143 -1507 -4604
557 -4604 565 7700 506 -4221 -1931 4474 3275 443 -373 12235 8501 -7977 -2801 -1595 -2888 -528 4353
574 4353 6791 -1587 -6943 -4266 6124 -485 -11116 903 665 -2082 -4411 3778 -3165 -4049 -3857 4791 2563
591 2563 601 -3672 4815 6690 -2223 -2624 -2577 6533 258 -3724 1762 1396 -2191 -2070 454 7800 -2185 -2533
609 -2533 2081 2941 7762 -4097 3313 2171 1861 -2640 -2117 2154 -1813 -4343 1416 4741 -2685 -5403 4510
626 4510 1614 -4218 262 3891 1358 -3918 1406 3301 -2091 -2987 2504 1295 -1114 -3252 -584 138 -6052
643 -6052 -849 4032 4232 -4596 -1963 1618 10575 3916 -4140 6512 679 -5302 548 2874 -4809 5612 -5409
660 -5409 -2890 3171 5986 -9962 3296 6796 924 -1287 2531 -1819 3298 -5421 -1487 846 335 3750 5862
677 5862 5565 -1633 1194 4029 -389 -1439 -2560 6038 -195 -5739 -3946 5495 6651 34 1269 -1771 1456
694 1456 -1986 -3552 7858 -495 -2960 1527 -2655 609 355 -432 364 7774 5923 -5536 4203 8586 -6232
711 -6232 3713 963 -5280 -9089 -7265 2842 6863 -5914 1321 6156 -1082 -200 5104 4739 -8070 -1258 -2862
728 -2862 -2662 62 -3427 -1116 5498 -5984 -2527 -7080 3304 -13216 679 11 1273 5835 5216 3997 -1095
745 -1095 1928 -3037 5262 5933 1886 -3008 666 4714 1819 355 5493 -54 1833 -1540 1241 -978 -6798
762 -6798 4956 -1856 3603 4533 669 -4312 1283 -2289 4217 4951 7 -1354 -220 -2044 1704 -2446 -5852
779 -5852 2367 -4946 374 1117 -3235 -3153 1848 1660 721 -9541 -10123 -410 463 -8198 -5781 1817 -5765 -2390
797 -2390 2237 53 -6251 2911 -2924 -5449 -2191 -2993 -2481 1056 -1169 -6814 421 -2242 -6510 1357 6132
814 6132 -1717 4484 4429 1106 3419 -3468 -1156 732 3999 -2777 -1472 -1571 -1378 -598 447 -722 -4082 97
832 97 -5929 1949 -4713 935 -422 2913 4450 -5417 1917 -19 -7138 -382 6239 -1197 -4080 -4052 2278 2854
850 2854 5463 2182 4811 -326 -2137 -1234 -2405 -3668 2631 -1529 1591 8273 -1307 -2816 1323 2224 -3260
867 -3260 -3167 6282 -514 -1453 1355 -2640 6881 -2931 -8094 2657 -1285 -6139 754 6159 -339 -4242 -4999 6229
885 6229 -2385 964 -1483 1208 1440 -3711 7950 4600 -3896 -4983 -3006 2618 -3559 345 3696 3129 1335
902 1335 -3775 1001 3801 3464 1294 2506 1997 -2319 -4091 -2715 3652 -620 -2642 1845 -3012 3815 -607
919 -607 6017 -1485 -7257 2466 2222 3878 -4971 5420 812 2340 -8312 1420 5670 -3969 -1509 2852 -40
936 -40 2266 -1493 -12351 5517 -444 -9694 -1640 374 -875 -7962 2013 1979 1507 -13831 1297 72 107 -8710
954 -8710 -283 12909 -2105 -8130 4222 5449 -704 -810 1597 7907 -2042 -7182 2943 11783 -3469 -9569
970 -9569 7865 3141 -2070 -3871 -1038 2833 -867 -2882 -2744 -38 -1757 -9704 9265 9398 -3663 -2985 2963
987 2963 6040 1766 -5308 8272 6079 2501 -4056 6246 5528 864 768 954 3911 -151 -7187 3818 8705
1004 8705 -5956 -3672 8006 -1809 -7352 3396 1399 4588 -2969 2047 4484 7664 1345 1451 4961 2256
1020 2256 -6226 -2438 7137
1023 7137
##PAGE= T1=  0.1372998E-02
##FIRST=  0.1144165E-03,  0.000000    ,      -9437,       7818
##DATA TABLE= (T2++(I..I)), PROFILE   $$ Imaginary data points
0 369 3084 -14365 -957 22331 -3287 -20084 14490 1043 -15063 -2230 2377 6169 -4043 -19623 -399
15 -399 22276 -17751 -10791 12898 1015 -13194 2265 -4480 7404 1526 -15447 12168 21120 -22350 -6909
30 -6909 13805 -3815 -10922 -1453 -3292 12507 -6578 -13769 13544 12500 -14875 -2389 22412 -11381 -8508
45 -8508 484 273 5697 -9370 -11794 22608 7033 -26286 -4322 12086 -11985 -3228 281 4986 11715 -13780
61 -13780 -5929 24251 -9536 -21230 3392 14633 -5763 -8807 1051 9003 4684 -14854 -7828 19639 -5105
76 -5105 -12575 12949 3859 -555 -6954 -1393 6131 -711 -25914 2649 22904 -13911 -10253 9163 -4590
91 -4590 -5042 -598 -1929 4722 3675 -18027 8804 16025 -22022 4391 16046 -4867 1481 1248 -1626 8860
107 8860 -6273 -20858 17709 10048 -13804 3500 8010 -12655 -5474 3189 -8840 16211 -9233 -14843 16342
122 16342 3797 -16847 7035 12470 101 1862 395 480 14121 -15688 -5638 21983 1575 -15867 12200
137 12200 1887 -5568 -7736 -2096 13098 2967 -16946 3489 13807 -11942 -12623 9156 4000 -615 -4539
152 -4539 -3706 6238 9473 -11550 1226 15434 -18738 -2649 5509 -1630 514 -11024 772 11591 -232
167 -232 -18204 13413 3532 -13287 2454 4187 -4748 7358 -1476 726 15067 -8829 -8562 9851 -1695
182 -1695 -4526 -2166 5756 429 -1813 -8449 5535 2631 -7629 -6990 10563 -4942 -4436 -1 7563 1538
198 1538 -8392 -1790 2988 -472 -10664 -9023 8191 -1153 -8099 5076 6981 2739 -7201 1840 6383 -632
214 -632 -9613 -709 7716 5219 -6333 1489 2522 10566 683 -2044 8920 1528 -8006 7095 7059 -3878 -6105
231 -6105 -4116 3023 -4058 -5264 -72 6287 521 -8694 7663 232 -8734 3359 5656 -971 -3879 -11649
247 -11649 1016 6195 -2834 -7403 11946 6495 -10375 2931 6236 -4741 -4686 3901 2865 -2213 -3351 -4507
263 -4507 4708 -1677 -13810 4774 1359 3834 606 -6357 6161 -693 -6511 867 9190 -2908 -5279 -4558
279 -4558 -4473 -218 1928 -8821 7210 3083 -7627 602 13194 1491 -4530 -1615 4626 -227 -1757 -1480
295 -1480 2293 2465 -7393 6254 1011 -1919 2027 -12350 3846 -3364 198 553 1228 2362 -2007 9872 1299
312 1299 -4179 7922 390 1928 6422 -62 4219 11087 -5527 -12961 1899 4924 -6173 -3284 6618 -2853
328 -2853 -2676 -106 -2257 -4153 -3482 -4555 5268 9727 1630 -2540 -1036 -3208 -2650 4572 -5382 -1418 1636 -801
346 -801 -2061 -1186 -1520 3963 2424 -347 -4927 -1764 -3486 -2522 -2479 4668 4829 3793 -439 -5041 1222 -1171 404
365 404 -820 3491 3981 762 3188 3208 7913 -283 -799 4926 2146 782 -6482 13118 1385 4418 112 -2928
383 -2928 -4586 680 -13 4174 -111 -590 -2331 3126 -1086 5907 -5258 -1642 4208 251 -3539 -6899 -89
400 -89 3007 -2758 -1081 6255 2925 -5017 -9544 -9395 3837 3028 -5442 1500 -3886 -2863 -294 3232 7204 2553
418 2553 1045 -5566 -6983 -1570 -3019 1520 -9278 -4162 -7357 -2130 -5521 -4143 1211 2087 6027 4555 820
435 820 441 1248 -1779 -4931 -2708 -9890 2576 -6539 5782 3390 -841 -5435 -446 -1909 -4029 3596 798
452 798 -3316 251 1319 -662 -4702 3863 1289 4299 -5577 -7704 311 8301 -1302 -3063 8673 5187 1707
469 1707 -598 989 2625 1016 353 1610 -1297 -1785 -2248 1311 -6752 13 -1554 1723 3479 -8608 -7205
486 -7205 4508 7271 -3552 2740 -1643 -2201 542 -2049 5479 2082 -10928 -3562 -2108 -6591 -1418 1836
502 1836 6837 -2214 -2354 -2664 2249 -1448 -5146 -2441 6424 -5338 1366 1044 -1923 -1188 1893 3029 7653 -8210
520 -8210 -4994 164 4311 -5362 -6026 -4615 6293 191 -8731 4910 10867 880 -5734 4079 9926 3103 -1983
537 -1983 4797 -5423 -7836 -5433 -2668 541 3328 -1530 7378 -10 -960 -2909 4185 -2933 1573 195 -3881
554 -3881 97 -262 -5051 4195 -1644 -4196 2044 -3227 1816 4972 -2748 3531 4797 -7834 -1073 7887 -4946
571 -4946 2384 4089 -3391 -895 3444 707 2959 1999 -8367 391 -3626 1609 1507 -985 1698 -3795 -5397
588 -5397 -2903 -190 2189 -1720 6993 1881 -1896 -8492 1643 3077 -1711 404 -8680 2746 -7036 -3800
604 -3800 -1369 575 5456 2191 678 -4133 -5277 -10264 -4832 10075 -5876 -1790 3186 5295 1643 -312
620 -312 1778 3468 -265 -7188 3238 -3230 -6836 -1278 2793 -7262 -4132 -8370 3212 1732 580 -1664
636 -1664 2970 3938 -9483 -2895 3138 230 -4146 4226 -4357 930 -4451 338 1528 2921 -1574 -7240 2804
653 2804 -4121 -662 3664 9358 2771 5290 -2482 22199 1548 -15332 1186 2433 -697 758 6520 -263
669 -263 191 1882 -3163 2809 -7165 -2568 1346 -1899 4363 1275 -683 -4474 -2474 -10709 3260 2988 -5427
686 -5427 -4295 1981 -1434 -2082 -6664 -2248 869 257 27 -2897 -3557 -646 8120 4468 4592 -13829 -3914 -1385
704 -1385 -1163 -1387 -1584 6154 -533 -6805 2415 4015 1173 1373 587 -3035 7348 1000 -1235 8293 3464 -1311
722 -1311 -174 3289 2400 6434 7817 -2817 -3002 -4096 -240 8559 2784 260 -7984 7123 2792 -5173 -7481
739 -7481 -1186 -2599 1548 930 -808 4042 681 -6848 -12 4839 1608 -665 3763 2579 1508 -2067 -425
756 -425 3381 -3215 1673 -2552 -17 -1676 152 -702 10269 -2790 2884 -3773 4970 -1661 95 1439 -2471
773 -2471 -5003 2177 4094 271 -5846 4550 1424 617 -4734 -1880 140 714 -3152 -1070 -517 -2206 -1746 -7065
791 -7065 -3599 2492 -4150 -1277 216 2009 -2769 -1670 3254 -1088 941 -7233 -2131 -63 10574 2832 304
808 304 767 -824 7680 -5081 -2676 581 -6018 5249 3941 -2068 1092 -691 447 5225 -3582 -5517 2033
825 2033 1059 -8841 -2341 -984 -6258 -240 -2557 -9074 532 4952 2151 -1426 -3946 1538 -1673 -3860 2384
842 2384 -1920 -675 5603 68 -6348 3699 -1190 1423 -3521 -1799 6736 4590 216 3188 -1848 -5452 11700
859 11700 3712 -238 953 -269 3051 -4612 -5320 -11533 1818 -2463 -8685 -3092 3970 -1007 -9370 -4465 666
876 666 2898 -4717 -7749 6944 -1614 -2391 -4857 2610 10498 -13131 8298 566 -6467 -8397 5654 5898 -1281
893 -1281 -6096 2945 11789 -487 -7075 3813 6009 -2967 98 1682 -4485 -1384 -8975 -5111 8373 -2679
909 -2679 -6310 -5667 3016 -10742 3112 -111 -7147 1973 -2325 3894 7102 -5654 -2017 4621 -1592 -2098 3147
926 3147 2636 3820 -1328 -7350 6432 1660 -9125 11534 5070 -2721 -7626 1173 1108 897 -2854 -595 9242
943 9242 5797 -3835 1539 -2156 -3639 -12448 -4326 2999 1959 -7184 -3299 14583 2265 -3878 11511 1593
959 1593 3370 -2886 4659 4951 2442 -7459 6984 4345 1566 -4441 6435 12903 -8279 -8659 5190 3382
975 3382 -3031 5835 3475 8056 -6276 -4945 9366 478 -12121 -1392 1751 5120 1494 -963 -5412 11331
991 11331 -7112 -9866 -5027 7048 -10842 1601 2679 484 -6528 -8743 9336 1280 -7780 -5720 5262
1006 5262 6347 -4296 599 6007 4554 -3398 -767 995 -3616 -7367 -4559 9867 -3244 -8828 7748 348
1022 348 2905
1023 2905
##PAGE= T1=  0.1487414E-02
##FIRST=  0.1144165E-03,  0.000000    ,      -7220,       8454
##DATA TABLE= (T2++(R..R)), PROFILE   $$ Real data points
0 -306 1697 8934 -20385 336 13437 -19582 353 15856 -15027 1794 3266 -6039 10545 -2381 -18070
15 -18070 10957 10709 -19625 1430 746 -12842 -4173 3293 -6910 11279 -4837 -10948 17504 -457 -7763
30 -7763 6039 6201 -6424 392 -9524 4633 7060 -11561 -6082 10690 -3957 -15645 15064 2596 -5798
45 -5798 6128 -6490 2688 6054 -6643 -8305 12358 -2576 -9720 12266 1211 -528 2782 -1751 3897
60 3897 2938 -9344 1919 5987 -5825 -5297 5333 1232 -5835 3871 239 9580 2703 -6101 -292 8675 -8000
77 -8000 -7556 9039 -2295 -2721 10568 -4611 4078 1900 -9415 2846 6352 -14242 -2230 13951 -5282
92 -5282 476 3011 1008 -1463 -3331 -14008 5247 5295 -5186 4169 8509 -12844 2557 -3920 -8957 2422
108 2422 6083 -9016 12364 -5631 -21447 10996 3450 -7080 9930 -5252 -15293 4793 -7740 -8975
122 -8975 17616 -5790 -10869 12289 -3803 -3656 10215 -9926 3182 8451 -7739 3949 13986 -12708
136 -12708 584 18647 -7688 2240 6082 -9402 1300 6709 -10402 8933 2582 -9876 3282 5612
150 5612 -6651 8588 -1314 -7536 15209 -4245 -16495 9238 -1622 -17493 4165 -2811 2282 10978 -7764
165 -7764 -4365 5648 -3109 322 6834 -1368 -3283 1943 3462 8175 5563 -10397 -4607 9865 -4029 -2055
181 -2055 10319 -4600 -5964 -1956 -7678 -797 2152 -5722 -1243 5353 -6504 5594 4173 1335 -4904 7555
197 7555 -4461 -1299 5521 -4333 951 1449 -3014 -3015 5105 -5902 -6779 3433 229 4046 1071 1084 -3644 4186
215 4186 -2226 -965 4095 1514 -260 1766 -3306 -466 1874 -3927 1231 6286 -7459 1526 6833 -8027
231 -8027 -1619 4204 -3716 5747 3135 -5941 5782 -518 -5500 7723 4261 -6539 702 -2192 -2285 6040 -5028
248 -5028 2306 11339 1144 -9809 4376 -2588 -4820 7997 -1259 -4576 5268 -9699 -25 6344 -7600
263 -7600 2089 -720 -1797 -120 2591 142 5896 1203 -7542 3298 1853 -5791 1192 4168 -7559 -2450
279 -2450 -615 -7056 1904 -1299 -10262 106 -2811 -8682 -3061 -100 -8140 1 6318 1136 -2242 620 -5019
296 -5019 1416 4087 2992 824 -588 -4 3507 -2827 7783 829 -8982 -6081 2891 938 -2065 -521 459
313 459 -5793 -2383 -3164 6171 -5114 -2286 1228 71 -3631 -503 4503 2738 -3352 -4967 2998 -3282 1646
330 1646 -2295 -2238 3607 4184 1432 8582 3251 -858 -4986 -1932 -2561 4214 -4385 -1147 -2977 -2893 3904 2497
348 2497 -395 -5721 8610 3971 4308 223 -844 -1968 -2735 -4393 -4271 -1544 -1581 -1974 -2551 -503 1770 -4552
366 -4552 -14 626 3498 -4459 17 -78 -1216 -618 265 1786 164 -3757 2683 5756 727 -4788 9168 636
384 636 1725 286 634 3685 3446 -6114 95 -3894 5706 1088 -2478 -4495 -2043 548 -2938 -1881 4971 -49
402 -49 1800 7133 -5655 1707 -6478 -3346 -918 1806 -3822 7371 -713 -1778 -2443 -5749 6578 1020 408
419 408 -3505 4983 -1742 3919 -1271 1570 -4612 1983 509 413 -673 3469 -2374 6454 1197 -4048 5874 8893
437 8893 3779 1111 -5639 -2537 -1553 -477 2153 -2335 -4873 -349 -1313 3595 1408 3054 1417 1775 -1885 2025
455 2025 4240 -3081 -4228 -661 473 -1571 -3351 5193 -50 6446 4532 822 1622 358 960 2040 -2834
472 -2834 4380 -2451 2810 3606 2221 -2324 -1734 -2450 -1704 -365 -3662 -1510 4749 232 -4290 -3755 6961 -7147
490 -7147 1850 -1012 -129 -5346 -824 2557 3665 -10987 -3984 -338 -7955 -281 -51 6785 1599 1993 1295 -526
508 -526 848 247 -1596 5683 -5857 -867 -3402 -897 3358 269 -6537 5334 -1118 -4653 1321 2986 -10133
525 -10133 -2740 -4713 -1205 3144 1670 -2890 1283 -2454 -6095 6340 4966 -7468 -3521 5190 1084 2518
541 2518 -905 -4548 8007 -2577 -3486 2782 -2272 1239 -52 -2998 4016 7797 -5072 699 -2943 -6087
557 -6087 -2505 6875 -3919 1822 -3316 -673 4278 2061 -4462 1414 -669 -4523 5988 4552 -4283 -545
573 -545 443 912 2933 943 -2439 -2069 1372 1174 405 2654 579 -3426 2839 -1835 -5126 -111 -681 1132 -1496
592 -1496 -457 2320 -1981 6126 -4503 -3770 1607 2194 -4704 814 -2566 -3368 -620 7453 -2460 2328 1090
609 1090 1296 -2840 1969 -7219 437 921 -696 -9158 4377 -6351 2950 -4897 587 -363 2492 3424 928
626 928 301 -248 -5964 5060 64 -6916 797 5049 921 4427 4375 -426 3721 2514 773 3714 -125 -3573
644 -3573 5752 -2886 2102 -251 -4514 -1548 1555 -898 -3752 1066 -517 4909 -654 -2579 7032 3207 -7669
661 -7669 2796 428 -7852 2256 109 -5515 -1202 -1231 1498 5492 -2367 -2612 5751 -9062 -3223 3450 -4712
678 -4712 4648 -2292 1450 3430 3257 2417 3452 3756 -5968 5675 2007 -1878 -676 4972 -161 -6046 -1399
695 -1399 -4407 868 5790 -7810 -1459 833 -2909 2615 -9657 -3278 2292 -2972 -5067 1063 5295 -5342
711 -5342 806 -296 909 3029 895 -4691 -4330 -1684 -2412 -1248 3530 -1177 -4714 -2026 3606 -2139 -4274
728 -4274 880 3837 -30 933 160 4580 -2997 3985 5605 3503 2915 -5164 4670 -1730 -745 4979 954 -1648
746 -1648 1472 -1309 3157 -7205 1589 -1606 -5227 4958 2546 -1159 7662 3231 -2215 743 5318 -318
762 -318 -634 2364 3107 -6235 1143 6077 -4006 -2217 -906 931 2986 5780 5472 568 -1994 3805 -1398 -205
780 -205 -3075 -3299 1084 -6778 -1545 -4269 2397 -2183 -1551 632 -3913 5319 -2044 1433 -2384 3201 649 2303
798 2303 -741 -491 -2322 -6283 4004 711 4265 1283 980 -2196 370 542 -1511 -2152 1973 -283 3159 1703
816 1703 2975 -4373 -1668 954 -140 3414 -2668 456 4633 3198 -1819 -2766 1631 -803 -1469 824 510 -5446
834 -5446 3789 2400 2202 -742 -3471 -698 759 -38 -3742 -2066 -1022 7412 -3799 -217 -4299 5397 -2518
851 -2518 171 -2982 -826 -2557 3030 -2997 2514 -4718 329 1336 4625 -1548 2886 -3662 -2153 -1109 -1199
868 -1199 -1341 -6610 -1114 4861 8264 1497 -6471 1136 787 -4165 -1613 -972 -22 1772 -6302 6881 3869 -7060
886 -7060 -2734 -1708 5314 887 3837 2993 5632 -895 -382 -4667 6181 2987 -1452 -1837 2380 -3838 -3391 1781
904 1781 3747 3700 -12085 -5979 -592 441 -6600 2564 5005 -59 -1980 1370 242 -3207 2351 365 5903
921 5903 -5838 -2336 2475 7144 -4513 7027 2745 -2863 213 -6908 -2562 5282 948 -4463 6892 4148
937 4148 -1812 -2801 -2530 4522 942 -7542 -468 297 -1630 -5175 4497 -3487 -7008 -111 -2620 6470 -1864 957
955 957 7540 -2235 -2326 -5997 5331 -4774 57 -5061 -3879 -466 -4310 1995 8559 -5282 -5934 5840 5310
972 5310 -59 -3415 -1791 3388 -3231 -3824 2557 5442 -3776 871 -3818 3346 -1594 -4425 -2364 4152 -2097
989 -2097 -1111 1429 2235 -3740 -6302 5572 2290 -1774 -2261 6694 1189 6548 -2068 960 7569 -8406 -3952
1006 -3952 5795 1003 -1812 2460 1849 3923 1213 -4115 5460 5128 -8532 847 7981 -715 -7406 4137 1089
1023 1089
##PAGE= T1=  0.1487414E-02
##FIRST=  0.1144165E-03,  0.000000    ,      -7220,       8454
##DATA TABLE= (T2++(I..I)), PROFILE   $$ Imaginary data points
0 399 9612 -16269 -7630 21262 -13095 -17527 25756 -5239 -10966 18145 -5863 7250 5725 -19255 305
15 305 19890 -17326 -10756 16925 -13393 -5898 7587 -5169 3029 -2951 -11544 6194 12407 -12910 11767
30 11767 17214 -16307 -1581 4665 2196 8887 -4984 -13969 18370 5772 -18937 8552 10756 -10280 1255
45 1255 6646 1552 8342 -2145 -13430 16203 -873 -12173 11400 8241 -12476 -1509 1698 2848 737
60 737 -12977 841 13554 -4419 -5447 10886 -1214 -13166 2103 -3363 -4782 -2805 -7125 -261 7456
75 7456 -2906 -10741 10641 -4023 -18840 10336 3022 -9249 1852 -7929 -3198 12155 -11029 -6320 13130
90 13130 -9387 -2385 1587 -4788 3047 5356 -13787 13822 9330 -17813 -269 13540 -9762 -4044 6013
105 6013 -9787 1157 8188 -17838 1456 12106 -19117 6222 10050 -14689 4604 2432 -9392 11439
119 11439 5003 -7337 11896 -2185 -12564 15645 -5507 -919 11749 -948 -7822 14070 -5714 -3862
133 -3862 12990 -9191 -6603 13856 4495 -12692 8376 -4886 -1131 10883 -11384 -1222 9987 -10099
147 -10099 1889 4341 -8039 6327 1059 -7991 12390 2227 -11245 6925 1803 -18854 554 780 -3224
162 -3224 596 -2378 -14708 9450 -2124 -4871 12854 -3513 -16192 5792 -6287 -2809 10950 82
176 82 -805 11395 421 -6426 6900 -2431 -8472 -231 -3906 1836 1010 638 3423 5751 -3966 -4601 1805 -5129
194 -5129 -4183 -317 6488 -4970 7041 -3195 -2154 -5800 3836 -3837 12081 493 -6662 -3151 6454 924
210 924 -3406 -537 4394 -1903 -3775 -655 4497 2705 8111 4971 -4834 5203 -3248 -8092 503 4649 -8065
227 -8065 -454 14183 -4589 -8169 2921 -2039 -4146 2013 -10396 -3158 8813 -7844 1346 7219 -3190
242 -3190 4788 361 -2414 1068 7180 -6556 2473 6373 -5794 1240 -1141 -13652 -78 1503 -4549 3150
258 3150 -4893 -521 11098 2892 -1741 8169 -3585 -5137 1542 -5209 2456 266 -124 13573 10234 -5231
274 -5231 801 5338 -1029 3663 -1899 -1040 1899 6857 -1133 3528 -3536 -8726 -438 -1879 -1021 2689 4432
291 4432 848 -4023 -2345 -3075 3866 2214 -12143 3434 4783 211 2219 2530 7547 1531 -134 -9703 7500
308 7500 873 -5584 -3529 916 -4599 -2196 -7606 980 791 5851 3229 2703 -5328 -5445 -4566 4640 -3916 -3540
326 -3540 2583 3674 568 -984 -584 -5127 -3698 -5323 -2359 -10609 108 3127 6555 -2379 -6738 -477 3205
343 3205 -596 -190 -872 5667 -356 4404 4823 -7684 -4023 -2966 452 3275 2324 -1125 -7563 -1043 1731 1772
361 1772 122 -3366 -1754 -1330 -1720 -964 11300 3084 789 8686 -3374 -7593 5651 -494 6775 -2008 -1209
378 -1209 5174 1445 -826 2209 3846 -4765 5193 5686 -5313 -2543 4595 -4239 2728 -774 48 2942 -2552
395 -2552 1168 -406 -2575 -5206 -2833 -1040 -131 1073 1225 -5566 4352 2359 7820 7048 -3593 -2923 2121 3686
413 3686 3706 6777 4116 -429 1331 7954 4224 -6553 -3451 2197 2719 -1003 -10455 -1450 1498 -8366 5445
430 5445 -2706 2870 -3460 2676 4316 7310 5829 -5182 2530 -623 -2591 -4566 587 -1385 -3978 -2238 -1525
447 -1525 -5876 -1225 -2715 -269 752 -2544 3148 1634 3268 1647 -537 -1712 -3293 -2374 5963 -4065 -3357
464 -3357 -7976 -2853 1150 3435 -5376 3341 -4255 1409 2432 -2292 345 1611 4942 489 -412 1414 -516
481 -516 -1385 2758 -3391 -886 -4812 4379 1395 -8466 -3737 7402 2746 1382 1626 322 483 -1158 -2108 5171
499 5171 -2423 -2327 -4807 2002 -5707 -2459 405 -5258 -4342 -1105 -4958 1834 -5853 -6356 2353 -6405 4311 2480
517 2480 -5968 5334 -5809 -8109 -1901 2670 1953 6584 4890 -290 -191 5924 -3185 -6238 9437 -1359 4941
534 4941 507 -5985 -533 1399 3226 2894 -3060 -4983 2132 1848 -6311 8688 341 -7745 -1147 -4223 1201
551 1201 1783 4690 -2037 6803 466 -460 7952 -3512 -5487 4319 -3622 -1602 -1930 -2784 2975 6398 261 -2813
569 -2813 763 -1569 3160 5196 2501 -6747 6813 -4580 2435 -6518 -4093 754 2352 -4745 -747 -3290
585 -3290 -6967 6995 -129 -1071 5052 393 366 -3278 -8436 2725 -5640 -6350 -696 -4035 744 5423 4837 2863
603 2863 -3311 593 5584 -4870 -3326 1369 -1167 -3725 -5732 -2279 131 3703 1190 1632 6116 1657 -4532
620 -4532 1969 2589 -6378 4526 4004 2326 398 -5411 -1250 1070 -6869 -239 -2568 4222 -1653 -2106 -1825 5229
638 5229 1926 -5354 5393 -2199 -3138 4320 965 -1283 2136 -8899 3726 5144 -2693 2125 -2358 -1058
654 -1058 -5111 -2651 -2672 6845 2500 -3840 8321 -2835 -8066 1985 3776 -9332 819 2449 -8917 5003
670 5003 -1588 6053 9595 6196 -8276 3700 4152 -2308 -889 450 1964 -1035 -5541 2345 -38 -6819 -892
687 -892 -1663 -345 -712 -3337 4548 820 -1574 -1832 159 2160 753 975 5560 -8246 -8225 1113 4616 -821
705 -821 -6647 -2978 6099 1696 -1436 3729 8898 67 5789 1392 1138 8476 -10171 3012 3101 3104 -3630 -1618
723 -1618 -628 -5816 -4793 31 7807 -1713 4716 -65 531 3550 309 7217 787 -846 3236 5620 535
740 535 4643 1332 -6141 3402 2994 -4582 4399 -1896 -2310 6647 6983 -8198 5816 74 -4583 -299 3606
757 3606 -2654 6022 2857 -4756 -4242 6372 -1798 5293 1463 -4496 233 -3152 -1859 -2569 -2152 1880 2572 -2134
775 -2134 13575 3922 -5456 4100 1593 -8959 2803 8280 -8598 1512 2240 -3294 -786 1286 -11048 -2091
791 -2091 4188 1550 5093 -2968 -5492 -453 172 -1669 -2226 4197 2125 2070 -1649 1092 -1958 3481 -2898 356
809 356 2840 -2324 3839 7504 -2090 -1747 5452 8343 -1856 5855 -4741 -1068 6743 2031 -726 -1980 -3204
826 -3204 5330 2519 4080 -40 2376 4628 -3394 -1016 -7998 -896 2804 1369 1884 -1272 8149 2378 240
843 240 -2576 -2447 -5743 3649 -990 7337 -3421 -2579 12886 -3146 -1672 3442 5865 8037 1681 2526 -7469
860 -7469 -2239 -2418 5625 -10745 -8210 2551 -3579 7297 -2583 -1820 5020 263 -945 -1771 -3100 -4053 -6594
877 -6594 -885 -4198 1709 1930 -4163 3189 1824 3053 -4232 7781 3394 -4818 -455 3522 5215 4097 -4206
894 -4206 -1392 -2079 5762 3451 -4680 4082 132 -5342 1974 2323 8578 -1574 -5354 -444 9781 1974 2977
911 2977 8397 1017 175 -7836 -1900 1784 769 1631 10795 2791 2303 3600 -2951 -4544 2693 -2622 115 3810
929 3810 -10800 -3880 5789 -1828 -1221 -2013 4352 -2699 1456 -3010 1093 -758 -5583 2086 -1292 -6083 -6932
946 -6932 5560 -733 938 5791 -3357 -2837 -221 -349 10585 -790 -1536 3771 13363 -3723 -2187 2490 4807
963 4807 5829 -310 -1258 14470 -1414 -5113 -4221 1343 -7224 -703 619 6340 -1013 -4839 3034 10959 -2124
980 -2124 -1212 2798 4719 1438 -2688 4902 1862 -252 -7684 -583 2530 1892 -11286 8043 2347 -3263 -9044
997 -9044 -7656 -1162 -893 -8009 -2579 7776 -6750 61 2133 3858 -7284 -6327 1307 1125 -12929 -1320
1013 -1320 8769 1691 -7479 670 5915 -2735 -8099 7592 2836 -1828
1023 -1828
##PAGE= T1=  0.1601831E-02
##FIRST=  0.1144165E-03,  0.000000    ,        118,       1462
##DATA TABLE= (T2++(R..R)), PROFILE   $$ Real data points
0 5 -1063 -2892 -332 -1975 6400 6581 -2925 -7563 3164 214 3290 7316 -2984 3607 -2625 -2840 -9437 12342
18 12342 2511 -3644 -5340 2481 9194 -505 -9 1831 3936 -6222 -5429 9940 2989 -7157 -4547 -3066 1100
35 1100 -3623 -2662 -3175 -1326 -8086 1269 7830 2645 -4212 -4141 3365 -5016 43 -3048 -2122 5574 -7788 -7668
53 -7668 2500 -1214 -3713 3875 190 -5756 29 -2120 1076 4171 -10042 1688 2733 -1749 -4745 -801
69 -801 4870 828 -5920 4464 6990 3085 -2250 658 1513 -1150 -735 -5039 3649 6787 -4018 -3101 5371 -2507
87 -2507 -6330 6753 1739 -3204 383 -3888 -1723 7684 -7028 4337 8122 -8110 -4632 11466 -820 -3762
103 -3762 824 -1027 3743 -294 -2720 1979 3653 -5239 3904 6021 1554 5131 2944 -261 -3840 -4240 -9548
120 -9548 5846 1475 -6022 3683 9671 -4717 -806 -767 785 3031 4253 -4402 6643 689 -2598 2701 8515
137 8515 -9362 156 28 1505 -7074 -4951 2032 2049 -1413 -611 4585 -2180 -5140 -1608 -4016 124 1757 -2745
155 -2745 -2359 5951 -1088 -1168 4219 -1637 1860 2229 -5154 -3208 -1242 -1746 -2851 2374 -10888 2300 5835 -12566
173 -12566 -1477 -3201 259 -6314 4646 -3823 634 -2564 -11524 679 5078 1407 -2118 1108 220 1107
189 1107 1234 -1550 1077 -503 -926 1280 1857 3564 -15219 2303 -1644 7518 -676 -4698 4123 2112 -2712
206 -2712 818 78 -1502 1124 -1402 3206 7286 2350 -6280 6624 1017 -1185 5079 1991 -1762 447 -5664
223 -5664 -2475 2525 3088 -2365 3703 -1779 2424 1541 1958 3039 848 -5627 -2220 1501 2311 -2888 -4246 -2847
241 -2847 8758 3309 -403 -226 5372 -3388 -2578 423 -3219 2735 2278 -1723 598 853 1670 -362 360 -8656
259 -8656 -4578 -2158 -2930 -999 2767 -5257 4132 -514 3750 -4094 5186 89 -8553 624 -5043 7238 -3226
276 -3226 -4804 -3303 -3918 -1216 -4938 -7324 6261 -136 -1299 -2285 -1843 238 -201 -2582 -2932 -723 2 1705
294 1705 1722 -259 -902 3288 -43 -1611 -598 -5944 -758 -598 1875 -3135 361 1878 -1575 4551 -520 -961
312 -961 2271 -6626 -5418 1537 4162 -3253 578 -3131 -2987 1081 2510 -8044 -2148 -1729 4886 324 -5496
329 -5496 -908 -1186 2124 -2898 -3804 -1198 -4112 -3763 1111 -1185 2596 -2635 -2899 2331 -2329 -5329 -4704 -10464
347 -10464 -3296 -708 3827 1339 4618 -758 787 -2454 -2679 -47 -811 -3276 1527 -4441 -1744 -1312 -3695
364 -3695 1857 -2305 -699 34 -2646 5864 1011 4077 -815 552 -3619 782 -874 58 -105 1917 3660 2086
382 2086 3076 -568 3305 -41 1474 642 3036 639 235 948 2256 6149 -3791 -1738 5038 -406 125 -6175
400 -6175 4869 4987 -299 2966 -854 248 8670 481 2921 1635 -276 -4673 2584 1618 -1091 -748 331
417 331 -3998 3597 -2824 -5768 2376 -4599 -3040 -4712 -2950 9770 -3959 3906 2917 26 -2870 4482 -1202
434 -1202 6641 310 3311 544 -607 -20 2546 1637 7024 1825 -5692 3430 4984 -2211 3288 9321 -4102
451 -4102 -2590 -4231 -7882 -4718 -1460 733 3420 1306 -2957 -2230 2870 3196 2151 -3235 1870 -5666 -1595
468 -1595 -6282 4423 -1664 -1538 -367 -1955 -1047 3063 -3067 2740 -1651 1215 -5910 -1186 1832 -1849 -3805
485 -3805 209 -2944 263 2930 -3225 -2127 1163 -6878 -1125 181 -4240 -2553 3679 4717 -504 2452 1529
502 1529 -2445 -2796 8061 3339 6282 4875 -898 2040 -204 -2620 -160 569 3364 7723 -523 -920 -3389
519 -3389 -3459 1589 -626 3660 1350 -2386 6984 -9471 146 -2962 -470 -3089 2318 1942 1696 2301 4450 6081
537 6081 7251 -2258 507 6545 1865 -4941 766 1877 2663 -3486 -3776 -617 -2778 2793 -3527 442 2909
554 2909 -56 -7285 2117 166 -6050 -261 -970 -2029 -866 2232 -565 -1505 2152 1715 -1727 3779 5329 1778
572 1778 207 -1187 5370 3670 -1326 -2685 -4713 -4167 4005 5060 -1954 2229 -5879 3913 2837 -2599 1531
589 1531 3233 -3231 3278 -2306 2898 5434 4264 -3385 1136 319 329 3231 1431 -2721 1618 2773 -3995 -5772
607 -5772 2170 -1190 5355 -1889 -3185 5826 594 -1677 5110 -1362 230 877 -572 668 6592 -1946 3665
624 3665 -4338 1539 -1238 7599 -284 2362 2770 -891 -728 3617 648 4109 4003 4640 -3674 3258 65 1547
642 1547 2003 3831 -5289 -1567 -1494 695 129 -2118 581 -578 842 -5858 872 4027 91 1739 -2335 -4479
660 -4479 -1614 158 -234 508 -1719 1331 -4464 1197 -4470 897 -372 -573 22 -4922 -799 -1853 -5292 -1823
678 -1823 2678 5700 -309 850 4063 6239 954 -831 4113 3161 4575 -1501 -2983 -540 2006 -4705 -19
695 -19 5417 83 1804 2809 -2030 -276 6733 -3466 1926 1730 6436 392 -4986 -1526 -1743 1240 -2484 6113
713 6113 456 -67 -2151 5884 -2117 -2529 -1182 -3400 5348 -2462 357 2448 -4195 11316 -893 3083 -5228
730 -5228 -4050 -5265 269 -4224 -2147 -1154 -44 2222 264 -8732 -2698 2059 -4530 -570 1434 -70 4269
747 4269 -2378 -2144 3203 -4723 659 910 1078 5898 521 1941 1061 -2495 -920 3478 4684 -4500 561 1217
765 1217 -631 5418 -6895 -849 589 -3519 2323 4465 777 -1777 6755 4558 -4113 -3094 2783 45 1490
782 1490 -5167 820 -3021 -2035 1989 -339 -3203 -2040 3287 -346 4645 1310 -8000 6777 -632 2645 2521
799 2521 6988 4173 -2124 -767 987 -5601 -6885 223 -1684 2792 1681 -892 -2213 -369 -1712 2411 -3385
816 -3385 1426 141 -146 -6276 2787 -3893 -2536 5284 -765 642 2931 -4291 -2405 -1236 -747 -2947 1983
833 1983 -2578 -2394 173 2431 -886 2208 5598 -1648 1000 4213 162 2862 -1094 -167 -4154 58 4429
850 4429 860 6802 4236 604 3113 3177 -994 -3431 -4366 -2733 -2691 -1585 10863 -4576 486 -3470 -3201 183
868 183 -6178 1624 2180 1312 -3186 -1409 4361 -3348 829 -2124 -1639 -6356 -2006 -1093 -862 -5787 340 1232 1777
887 1777 100 3766 -4797 3311 -827 -118 -3231 1348 6019 -5283 9554 5438 3134 1187 2212 3403 1083
904 1083 2153 -842 4115 -3544 642 3129 -2967 1370 2939 5105 -3998 -2272 -7545 4043 4685 2701 2615
921 2615 -2157 422 -815 737 -3310 -2823 2589 -1639 2905 3530 1347 5937 2636 -1052 -1966 460 474 4154
939 4154 -4740 -2986 3520 1926 -272 3271 -504 -4719 531 -4098 2007 -3311 2274 -4048 -3185 -693 -3779
956 -3779 519 1251 -5275 -57 8303 2868 -531 -6900 -1165 -2660 634 -670 475 3729 4975 -5184 -2355
973 -2355 1860 -1232 -1248 -212 5749 6398 -2147 1468 -965 1455 2475 797 -2127 5232 3351 -1343 792 282
991 282 -1485 -1029 -207 -3747 -3956 6876 2939 -1808 2933 826 2050 4568 -3849 -160 -5650 1215 3402 -7065
1009 -7065 -6058 4428 1146 1068 -5456 -5830 4808 2648 4477 1420 -4682 367 -569 -1047
1023 -1047
##PAGE= T1=  0.1601831E-02
##FIRST=  0.1144165E-03,  0.000000    ,        118,       1462
##DATA TABLE= (T2++(I..I)), PROFILE   $$ Imaginary data points
0 69 -1904 7574 -6422 239 3858 5192 -4454 -971 3266 10167 164 1337 -6759 7476 -6336 -4474 601
17 601 4743 -6621 -3915 4349 4659 3902 -7683 3219 3882 -2774 -9927 6176 92 -8965 -153 3904 -1795
34 -1795 7306 -1301 -8123 6302 -4235 -5683 13467 3627 -11278 3898 8220 571 -4592 -5055 -3893 -766
50 -766 826 -6843 6130 10120 -9689 -2024 4338 -6772 4718 -5121 -1034 -3561 -2068 -2948 4205 -375 5104
67 5104 -3879 281 -4007 -2782 -6471 3772 1318 -1443 8231 3398 -10985 -7080 -1959 2159 3801 -8113
83 -8113 -3860 7471 -1159 -5485 11714 10583 -7122 -2887 -1164 -7888 5818 -6755 -2747 -1330 -8016 -2867
99 -2867 2754 -432 -9348 2763 -2 -6685 3603 -2136 10530 8852 -8277 -5683 5466 -8152 -6305 3211
115 3211 1530 -22 1163 -1223 -8947 6824 912 -3870 8639 -6941 -3732 5965 1660 -2331 150 1808
131 1808 1200 6776 -6633 1414 8441 -3195 -6147 2849 1659 4330 6306 2671 5138 38 -3111 7227
147 7227 -543 -554 1340 3062 -1343 3925 -2858 -3331 1608 -7915 -9163 5891 4855 -5131 6870 115 -6558
164 -6558 440 -8307 -1508 6585 -4720 -2401 10073 4087 -9242 913 -24 2579 2151 -12924 -112 3562
180 3562 -2342 -3625 2523 -5054 -3141 1702 -3982 571 1810 -6268 -5918 -4839 -2689 3263 9095 -7094 -6653
197 -6653 7596 -5173 -929 -782 -5625 -5234 1925 -1004 5089 504 404 -1595 8113 3328 6006 -248 -3434
214 -3434 4795 2699 -4498 1869 3682 -7543 2813 -2444 7279 1143 -6722 -4946 -264 1124 -6865 -2493
230 -2493 -3677 -1756 -2606 1289 4348 4458 -2102 2211 738 -4007 1027 4920 -642 -4233 2962 548 -222 2743
248 2743 -2109 -3177 4741 883 -94 4517 -2071 1265 1873 -1230 1998 1210 -6551 1690 7829 3945 -6374
265 -6374 6922 -1937 4066 5151 -1056 4483 6765 -1501 632 -674 -3059 -168 -4005 -9702 3594 3742 1335
282 1335 8453 5819 -1304 -3558 -2439 -563 -795 6015 -6444 6318 4623 4660 -1300 -209 -1822 -1260 -5254
299 -5254 -6771 8218 -5196 1651 -1903 1874 -4404 1221 -3597 -818 1313 -1605 -1764 -2406 376 -7759 -1791
316 -1791 2458 283 -5669 -1698 2941 4934 -2493 529 7598 2246 -4390 2779 -1629 -806 9499 -9894 2577
333 2577 4837 2215 -3040 134 2382 1032 732 -3719 -1295 -1698 -1467 1110 -1878 -1310 -98 9689 -1332 -1758
351 -1758 3957 -5620 7195 -4927 -6992 1260 3556 -1826 -1611 2058 6300 1487 9713 3727 -1660 269 -1427
368 -1427 540 -1824 2560 -3737 -8490 -4991 1774 -1160 990 -265 -2733 -1018 2189 182 -6582 -610 135
385 135 1824 -6547 655 2302 -3935 939 6453 1255 -811 -3131 -1090 -1262 1696 2195 8499 -1309 -4002 -3324
403 -3324 -6698 3983 -5578 1226 2167 -1973 -803 -162 -1193 -2236 4495 8500 1788 -4651 -1364 171 -3522
420 -3522 2188 -6553 3626 -9208 -5103 961 -3232 206 -4208 2214 -9512 -939 -2048 -1625 -884 2591 2328
437 2328 -1120 1986 1809 -5429 4425 -1657 -9385 -1276 -4023 2672 9694 -797 3145 -1378 5005 -2572 4140
454 4140 1231 -433 4406 1000 -1659 1776 2982 5134 -635 2151 3089 -153 -407 -4059 5831 -1251 55
471 55 15 -5577 -2879 -7803 1526 3473 -1500 8834 4625 -4073 3864 -1023 1288 -843 -3539 6030 -1310 3437
489 3437 4763 -1497 1608 -600 -1944 3280 -2898 1472 2633 -1854 -2252 180 2968 4440 5455 -5542 6753
506 6753 3086 -3455 -5129 -3774 766 -162 170 -2324 1400 -1518 2124 -2852 7993 -2667 3324 5977 -1971
523 -1971 -1688 2683 1606 8694 2788 -2533 -4371 -4039 7882 4002 4662 705 -3214 3262 6251 -5685 3156
540 3156 8522 -277 3617 -8 -1843 2742 2616 2125 -3818 -1351 -3707 1285 1195 4389 3135 4272 3445 -4352
558 -4352 -1969 3992 -6467 3428 -2498 -3858 -1415 -891 1281 -221 -671 -4997 300 -3969 -6557 -2248 -4585
575 -4585 255 4207 2905 117 8624 2761 -4601 1331 4577 -4112 -2272 -3489 -3485 -4974 5278 -10865 3137
592 3137 -4380 -4235 1990 912 -4272 3908 2988 984 -3073 -5470 6019 -5527 -99 -150 5415 2378 6765
609 6765 -439 1281 1029 -3418 -5240 286 -2923 909 720 364 -4109 1040 388 799 -1527 -6750 3431 -2774
627 -2774 -1437 498 -1419 1744 2312 863 916 746 4054 -4148 483 -686 10388 1414 4663 939 -4006 1839
645 1839 -3496 -4018 6002 -1571 200 -3063 -1721 -8704 -2518 3146 113 1582 910 3048 -2344 4367 2249
662 2249 4446 -6808 -2290 -2513 6512 2146 2480 -841 -212 3281 -1686 2544 884 6585 -5344 748 -440
679 -440 -465 1309 -2807 -2790 -1736 -4614 -3557 -2337 -4210 -3214 2731 -676 5061 -1262 -10259 137 -823 -2535
697 -2535 -4314 -3974 723 -856 7038 -2587 4128 -731 1579 4077 3278 6099 -6479 677 2722 -897 5105
714 5105 4706 -1906 3690 3537 1171 -3419 98 1627 540 -752 5570 4092 5151 3380 -264 2849 7608
731 7608 -4975 95 -4706 -859 -5046 -245 -2320 6971 2376 -5042 -6225 2706 -5740 -7044 -1367 -6840 6353
748 6353 -6514 -104 -3599 -4542 56 -9086 -1731 -2970 366 -1547 674 11939 -3750 -703 924 3528
764 3528 -3675 2304 4163 -3622 -1130 2185 -529 -1201 -772 -5799 -5719 1372 360 6037 6854 6436 1681 -4371
782 -4371 2800 -5260 534 -399 -4392 -3549 1089 178 1864 6374 -3015 -2609 5564 -2675 -1900 -5372 -2009 -1660
800 -1660 -4125 338 2732 2036 1750 -2370 1989 -3535 -4122 -2003 -2559 6338 -7975 4538 2062 -3336 978
817 978 1797 45 -4370 -1850 -7897 -5117 -1361 -1143 9768 -3034 -2414 -2273 -4453 5715 -1830 3679 4604 -1902
835 -1902 -3304 3195 -1295 44 -1720 2664 3517 4899 -1724 -4574 953 -2925 -3510 -124 -2462 694 -4683
852 -4683 4391 2605 2425 32 -197 -3255 7350 -2809 943 10531 -3267 5491 5355 8813 8298 5283 -277
869 -277 -1991 -3833 5266 1026 1062 -1483 -843 -1722 6632 413 -2562 -5877 -1070 6614 2084 -4780 5563 -2504
887 -2504 -5319 8005 -4986 -224 6659 -2518 -2932 2031 -5843 -10145 -1810 -4320 2047 2571 3479 2171 2333
904 2333 2138 -2332 4020 -1773 -1482 5544 3017 595 4634 4222 -8510 3177 4213 -555 501 4486 3126
921 3126 -7022 2463 7507 -996 -3134 -3495 -584 342 -7039 1363 178 4021 3301 -3852 6226 -1864 -7627
938 -7627 272 5364 2061 -634 -4525 -3273 2844 -4809 4503 -3175 -2249 -3707 233 3969 -181 1226 2996
955 2996 3925 3660 -6553 1820 -2138 -953 420 -3226 -3262 -1524 2675 -3048 -1773 2506 -3789 -1594 1170 -1943
973 -1943 2141 6708 -4427 -2202 1825 -5323 -2115 3009 -19644 -683 -3894 -3386 1448 699 -8862 1552
989 1552 3027 1559 2836 -1773 4686 -8304 2190 9863 3398 6794 3140 2132 -4900 -4044 4116 -1496 -3023
1006 -3023 -5124 3432 808 -2394 4959 -1197 -2550 -2125 4370 3108 4500 1936 3955 6037 409 929 -9838
1023 -9838
##PAGE= T1=  0.1716247E-02
##FIRST=  0.1144165E-03,  0.000000    ,      -1298,     -10191
##DATA TABLE= (T2++(R..R)), PROFILE   $$ Real data points
0 -55 -7396 -10764 17141 -6582 -22703 21965 5639 -15064 1555 -1602 -1870 8320 -13315 2645 21073
15 21073 -10943 -7701 19715 1065 -10533 8925 -6457 2196 2008 -17579 11097 14463 -18960 -1514 14125
30 14125 -10956 -2807 6714 -3331 8805 -55 -23224 20162 12749 -24053 576 6316 -4975 -6966 2552
45 2552 2569 8226 -3920 -5027 10024 1461 -19763 5289 7435 -6020 -11349 -3281 3490 1396 -6801 -5765
61 -5765 10664 1832 -11199 2507 10026 -4793 -6965 1049 3349 5757 -2541 2291 10017 -2701 -9517 6457
77 6457 2753 -2555 -4637 5261 4279 9342 -1324 -2 12517 -7986 -16858 10571 6782 -3467 2604 -2994
93 -2994 5112 2893 -3014 3306 16423 -13512 -15539 22974 -2158 -2623 2624 -3712 414 228 -12798 5738
109 5738 11468 -19932 -5315 23604 -2010 -13129 3546 -9439 -583 -4336 -22779 12207 8941 -16205
123 -16205 713 16396 -2536 -2015 6593 -9676 6420 -5577 -11596 17421 4227 -20064 6819 2975
137 2975 -8638 -972 -5423 -3469 8550 -11491 3706 15917 -2631 -11192 3935 -1526 -5440 3466 -8791
152 -8791 7079 2413 -14845 4406 12472 -8793 -869 8702 -2235 -3152 3833 -6206 5965 -5027 -12847
167 -12847 4762 13628 -10417 -6109 8763 1688 8558 -1088 6570 12469 -7004 -9601 6903 7248 -7952
182 -7952 419 11432 -4941 3389 -8572 -3601 2549 -7816 -5335 10493 5289 -9005 12597 6224 7660
197 7660 -2806 -4239 7993 7691 -14315 1182 5882 2437 -4752 306 9535 -5777 -6577 3042 10764 -27
213 -27 -6826 -694 2836 -4931 -5009 8213 7012 -1974 -4250 525 7596 4119 -3493 2517 11129 -5056 -5314 10871
231 10871 -131 -9338 4605 2056 -1681 5929 -3574 1893 7431 -5712 -8638 11601 -717 -5138 -2337
246 -2337 -6612 3374 1783 -7034 247 5141 -10349 31 7462 -3911 2245 3368 -1658 5518 1601 -7991
262 -7991 1017 7503 -10983 6090 -832 -6489 -2383 -2784 5471 7061 -1040 -1674 6831 -6702 -6773 3908 7342
279 7342 -3484 2105 -6916 225 697 -4208 1094 4484 -1298 -142 5980 -2367 -5991 131 -3641 579 3348
296 3348 -4632 -2233 7751 -6778 -3869 823 -4244 -2470 -2942 -3069 9855 -1352 -5976 5846 -3278 -1660
312 -1660 -3431 592 3216 646 2128 6211 694 5234 -6634 5806 -864 2396 -4553 3207 518 -2757
328 -2757 2506 -210 8862 2353 553 5328 1959 -7277 2468 1578 -1726 -1344 -3390 -5444 -857 1019 -7727
345 -7727 4620 -2795 -1242 -97 2465 -46 -1447 3022 -3999 -883 1229 -2774 -4619 -5798 423 862 998
362 998 3887 2972 6850 2764 -3634 -2514 -213 5029 -4604 881 961 1277 -1332 -498 -8236 557 -5684 638
380 638 7647 -5752 -5031 -101 1287 -2307 1690 265 -3877 -1057 5068 -1067 1924 -1576 -263 -1176 -4764
397 -4764 -769 -1480 -3537 -1244 2089 -199 -2810 2399 -80 1577 3984 -1958 3719 -6653 -4569 -2919 450
414 450 951 -913 -3203 1772 -1107 5377 -1417 -3440 1042 -5463 3843 -2050 2156 456 -2674 4058 -1021
431 -1021 -4038 -1762 1506 7494 1190 2146 -781 2439 3095 2712 -797 6881 3070 792 -600 5442 1939 2052
449 2052 7337 4082 3121 -4102 2672 4660 -1244 -5427 -254 -816 3193 -257 2804 -1781 -647 -5250 6996
466 6996 -119 -2449 3924 -1830 -4042 -590 3157 3190 6156 -5139 -4378 9513 2395 -2665 -3032 -673 2701
483 2701 2522 -3737 3777 -428 -3566 -6223 3183 -1100 -1981 2528 577 1944 -3931 -1458 -826 2491 -3574 2045
501 2045 239 -3972 -3433 4525 -2588 -905 -4943 -3810 -2325 -3740 -14088 5342 -2250 -1319 10209 2811 -743
518 -743 863 -10239 -1198 10373 -4467 -2049 3613 310 -11490 -3022 5368 -5087 2356 -7389 3071 12682
534 12682 -7668 5500 -2050 -5251 -4968 3603 3136 5606 -1664 -4141 2644 -470 -8969 2755 745 2139
550 2139 -4005 4868 2844 2491 3625 -3051 8847 1266 -2969 5992 -7674 -1784 -3896 627 1936 -1424 242
567 242 -2087 4157 1728 -5993 3028 156 -3738 1664 916 3100 3957 -7728 4025 1209 4740 -6490 -2296
584 -2296 -1956 416 -531 -6066 6954 -878 -4994 4431 6202 -8561 -3285 -1306 -5480 -1784 -3354 2297 1154
601 1154 -543 -4953 8519 2944 -2162 -1161 -4768 819 -479 -2116 2992 238 5102 -3357 5350 -1268 -12043
618 -12043 -254 -503 4260 2528 1244 -1655 317 27 -2811 2615 1923 -10374 -6116 5989 -2121 -1075 -4194
635 -4194 -402 -2498 -602 -6087 5280 1481 -4449 6928 5053 -6700 2465 -3363 -5232 4875 589 -3924
651 -3924 -556 1072 803 4039 1593 -1908 -3091 -7017 -2819 2120 -4064 6589 3553 -3111 -1370 -3241 875
668 875 -1709 1808 -1191 4884 4240 -4916 6340 7238 -4498 -2538 2960 -1262 9157 -1594 -3858 -2448 -3281
685 -3281 -6958 4339 8907 -5731 4586 1117 1821 3763 -6808 -2221 1523 -407 -3276 -599 1629 -2923
701 -2923 4879 -4509 -5574 3433 -5441 2369 2598 -3630 -870 -3200 5331 -4805 3605 4489 -668 -464 -4693
718 -4693 4295 -848 801 -796 6511 -1349 169 -5205 527 -3423 -562 4338 3965 -2544 1355 569 -1193
735 -1193 -1659 2796 -515 -1994 3318 730 -724 86 -2064 -2606 2219 6164 1690 -901 2260 -5074 3771 2900
753 2900 3375 1274 7541 123 4458 5089 -2336 1766 -3489 -7739 342 327 560 1447 541 504 -911 6232 2093
772 2093 33 -2452 3064 -570 -4445 -178 3657 -6331 951 2604 1258 -401 1491 4632 -4856 -1338 7409
789 7409 -614 -8815 87 4625 -3945 1512 367 -2064 -2878 -1861 -3343 1176 -1871 -1279 -2604 -2036 1780 1987
807 1987 -2223 4250 2413 -172 1089 -124 -3722 -553 -2296 -3090 -93 -512 6898 -1331 -5308 -1926 838
824 838 -4145 -2846 -705 3613 -4155 3548 1109 1633 -1243 -4615 -1922 4212 -1644 -3285 96 -2620 2518
841 2518 -7248 757 3313 -1846 228 -3555 -188 2992 3273 -1325 252 -221 -6507 -5079 3391 -538 -5677
858 -5677 -2977 2245 2211 -5621 1321 3437 -981 6211 2965 -2117 2058 5027 -75 1782 -4097 -4936 2077 -4210
876 -4210 -2921 -2258 3953 -7136 67 5318 4435 5895 -1242 -1604 1449 1331 2705 2686 -5137 2192 -1671 839
894 839 4662 2549 -2121 479 1793 3136 -4806 64 414 1051 -5413 698 5150 3794 3333 985 7315 -2237
912 -2237 2908 667 3601 5779 -2008 2936 7436 -3198 -4834 -2116 3893 -584 -1768 1441 3334 2233 -5106
929 -5106 -4929 9739 -6319 -978 4793 -886 4275 2302 3919 3151 -2833 -4513 7000 5849 -5942 2543
945 2543 7407 -4588 -1450 4432 -262 8194 -1340 -2354 2547 2379 -5667 -1780 5704 -5099 -2048 2493 2694
962 2694 9048 -7376 -958 8691 -616 -8082 -980 5907 -6510 -2641 3556 -5364 5891 -2446 -3682 6811
978 6811 -4035 -6597 12884 4844 -333 -4144 -1388 2771 -258 -3006 3340 6437 -60 -6152 9211 10149
994 10149 -3138 165 4790 -5883 -1606 -5476 4167 1378 -2838 -7180 5275 -2250 -1798 -1230 -6780 3393
1010 3393 5843 -2719 1963 7410 -2357 -6846 12362 -1980 -7412 5522 7551 1377 932
1023I32
##PAGE= T1=  0.1716247E-02
##FIRST=  0.1144165E-03,  0.000000    ,      -1298,     -10191
##DATA TABLE= (T2++(I..I)), PROFILE   $$ Imaginary data points
0 -481 -12788 21346 -1018 -21084 13226 19283 -17685 -3207 5630 -8521 8863 -5020 -12630 23688 -4575
15 -4575 -14745 23642 14840 -19235 9067 2677 3215 5639 -9869 -1888 19861 -13884 -11929 16626 1614
30 1614 -8982 3648 -1739 10486 4227 -22411 6860 23399 -19944 -5236 27363 2018 -3757 2669 6368
45 6368 3979 -3264 -8463 18949 4266 -16652 -218 10446 309 -9225 1017 7880 -5302 -6268 -7097 5631
61 5631 4936 -15531 2501 11035 881 -16561 -3927 7058 4677 -8492 -11816 4561 3420 -12923 7
76 7 11500 -12403 -11967 6984 2706 9096 -3617 -6987 217 -970 -20684 17111 13781 -14147 -5568 3301
92 3301 4135 5618 -6566 -8334 13998 -3868 -10707 14671 3840 -14587 3960 2891 -9447 4012 -11550
107 -11550 3743 23481 -9736 -22741 17506 6549 -14369 9718 -5595 1521 2144 -8922 3930 17755
121 17755 -10901 55 22422 -12871 -9844 202 -1828 4586 2543 -13596 11847 10947 -25392 1543 8443
136 8443 -10227 1590 1550 -833 9585 -6121 -11806 21131 6816 -24680 11713 5524 -13304 144 3227
151 3227 -2161 4339 -17330 -1960 19185 -6391 -15908 9365 5759 -8353 3172 -2537 -479 2250 -15081
166 -15081 7884 13254 -17067 -9019 14905 6939 -3064 10488 -5864 620 -2587 -13989 8000 8417 -11963
181 -11963 -6981 7241 -4248 -7698 -914 2996 2164 -11664 -3695 11722 9743 -7186 3734 8456 -3808
196 -3808 -11035 3333 6331 3803 -3661 -7875 6887 10501 -10618 -7327 9410 -12638 -9908 3181 2828 -2946
212 -2946 -5849 877 4615 9733 -8871 6528 13718 -5712 -11628 -2787 158 2100 -4786 -9632 1500 -467
228 -467 -7010 7639 9618 -5745 -2360 -3398 -3163 -3126 -10402 -2767 16337 -7311 -7472 8789 4104 -6145 4933
245 4933 7370 4295 6352 -7526 2361 12441 -1962 -5141 10191 -8536 -8947 11391 -4558 -439 9777
260 9777 -7224 8211 7216 -6974 7787 11158 -6312 -4807 -5704 -3302 2881 -5168 -9708 13115 2468 -10142
276 -10142 -1472 2575 -8655 560 -3968 665 8450 -6105 -9562 11103 3514 -7411 7646 -3178 -1045
291 -1045 -1557 -4384 1594 6147 -3091 5899 837 -2285 -3262 2151 -3293 10812 -2081 -6454 413 6888 -8241
308 -8241 -2925 6888 -8252 -3598 5956 281 -270 -3349 -4793 -4069 -1223 456 -3507 5939 2564 -3809 8906
325 8906 -5358 -6789 1898 136 -745 216 -2549 -382 1114 -1582 -3404 1882 -1340 -3475 -8308 124 167 4377
343 4377 -4243 -342 -6093 -4305 -732 3438 2533 -52 5136 -4462 6724 -141 5147 4776 -2041 -3045 520
360 520 -2739 9250 19 -3447 -4446 1352 3637 -475 6176 11912 2327 -663 -5886 -1934 1562 4109 -3374
377 -3374 2968 -869 -78 1572 -5654 -2022 3547 -5239 6385 1142 -2113 4974 -3282 -1736 1833 1032 -4030
394 -4030 -902 -4161 -835 609 -4887 -986 -2411 -1157 441 -8192 -1402 4388 3590 7565 -5970 -3362 4539
411 4539 -169 -451 6979 -4461 2419 -2773 -319 293 7314 1883 -3151 -228 4102 2950 4611 -1867 -5720
428 -5720 3954 3909 885 -5688 -7328 182 -637 -2139 -4142 -8786 -9784 -4329 3500 -5077 1182 4900 -7015 4689
446 4689 638 4863 -1576 2532 -3101 -253 2196 3434 2152 821 2383 4596 -79 2665 326 312 1036 -1748
464 -1748 3411 8687 2264 -6566 691 3322 -782 6865 -1181 -195 2934 -1731 5235 4176 -1639 -3129 5417
481 5417 998 953 -1796 2435 3458 -8198 -10477 2604 1827 -138 100 3607 -1112 -3861 1463 4520 -1696
498 -1696 -10181 -5703 5696 2345 -439 -1551 -2086 7759 -3358 -2275 8883 1315 -480 4934 9373 -3538
514 -3538 1587 -7768 1336 937 17 -4267 4418 637 -5456 2576 705 -5135 -232 -728 -1175 2691 -8645 1257
532 1257 4911 -6750 -2796 8366 -5101 -2305 5800 -916 11546 5740 -4341 1503 7248 -5536 -8750
547 -8750 10111 -4656 -10362 -818 -3633 6409 2603 -6059 5216 7490 -8729 -680 3796 1636 -5500 1494
563 1494 -4916 246 786 2967 204 7277 -2515 1765 -1005 -2563 8488 -5057 4043 1459 -1396 -7624 5582
580 5582 1721 -3616 5433 4621 -642 931 -5728 585 1483 -967 3491 3185 -262 763 6818 3813 4438 -2919
598 -2919 135 -2928 1992 -2779 4889 1893 -4869 -7368 7943 -1773 -3933 199 867 5588 -3015 3575 -1860
615 -1860 2559 -4580 4551 8015 -4208 -654 -2996 4702 -7236 5772 -5804 8296 2561 -3747 -7407 5892
631 5892 -349 -1490 835 213 -3743 1417 -7232 10287 7922 -6242 246 9178 2396 676 2235 1728 3265
648 3265 -1592 -8583 11730 4078 -7976 4576 -210 -3892 -3593 1415 3136 -731 -6871 -2075 546 -3108
664 -3108 -6112 5601 3267 2292 828 -299 -1275 2982 -8313 2272 5500 -6312 556 2975 -2076 -4069
680 -4069 4090 -6507 -1724 -31 126 540 1683 -10140 -99 -2564 -2696 -2503 5032 -4969 5576 -1897 -8760
697 -8760 9170 1954 -5862 -3647 7909 -3125 2523 2325 4829 -15 -104 3227 8744 1140 -4549 -1599 7368
714 7368 1495 -1452 3227 3030 580 -3114 -5700 4851 -4103 -4883 -953 2163 1171 -2053 -5445 -1997 1806
731 1806 -549 -7150 2315 -558 -7862 120 8814 1328 2430 -2432 -591 7902 -2603 2126 8234 -40 -2157
748 -2157 14029 2345 -1115 -1602 -1547 499 2691 6198 4033 4879 -4405 194 -5644 -1126 5957 -925 -2119
765 -2119 -110 948 -5367 -1672 1805 -1884 -1727 6320 4248 -1080 -154 -793 -3242 826 -5 1345 2653 -667
783 -667 -4110 3210 378 3290 5555 1974 5446 5154 -3926 1512 3102 3521 185 1976 -2587 -4477 360 4884
801 4884 2490 -2096 219 5888 4414 4794 1626 -3347 -6727 -2860 -1555 4693 4609 2645 -3253 -2961 162 6132
819 6132 1778 -1061 2902 3894 -4305 -223 -3445 7420 -4922 -1659 1244 -946 -2425 678 -4229 1803 -1719
836 -1719 -8559 4877 -266 -1133 -2865 9452 -4669 -5584 -4150 4905 -4898 842 -189 2552 391 -3439 -3934
853 -3934 -7647 -6367 -7685 247 9055 551 742 -8380 -1363 3407 -6700 986 1889 2998 3672 -1851 -407
870 -407 9344 1769 1312 7158 4262 -5020 -5305 -665 -1978 2730 -908 618 5914 -3574 -1103 1486 -4386 -2015
888 -2015 -714 4355 -3938 2117 1594 1011 4503 -6242 2041 -3320 -3133 -8324 1035 5786 3334 2389 -1080 8320
906 8320 -3028 -9212 4693 4905 -6006 -3176 -695 1388 -4075 -1718 -4189 3667 -6337 -11306 3764 6498
922 6498 -8461 -8359 7071 2791 -7233 2720 -5016 2582 -9335 1462 6979 -626 -3879 4105 4460 -1502
938 -1502 3866 -5519 2352 3456 8835 -3896 816 -9852 -11755 2865 7114 343 -9271 3117 6905 2509
954 2509 -4797 -812 4694 901 703 889 5642 2288 -5912 -47 529 3168 -7167 614 6769 -2533 -9041
971 -9041 -1672 -713 -778 -1260 1251 2887 3578 -11749 6113 7517 -747 182 4156 3144 2442 998 -1794 7900
989 7900 1074 -5952 575 1116 326 -3178 2235 -2202 1868 2457 8258 6599 -4975 -7324 9036 -917 -3673
1006 -3673 1727 483 3979 3965 -4662 -1699 5023 -2370 -11224 6873 1126 -8392 -1259 8864 -8300 -2859
1022 -2859 2882
1023 2882
##PAGE= T1=  0.1830664E-02
##FIRST=  0.1144165E-03,  0.000000    ,     -14392,       1186
##DATA TABLE= (T2++(R..R)), PROFILE   $$ Real data points
0 -610 -15502 -7325 18259 -3774 -15208 10814 5985 -7509 -6756 2911 9947 -2146 -10343 5365 12526 -8257
16 -8257 -4510 7961 5060 -5478 -6179 8079 16818 -5930 -10121 8305 7654 -6750 -1235 -2183 7186 280
32 280 -12310 1068 15894 -8825 -7855 9757 -1223 -10673 3025 4459 2166 -1282 -13308 7192 10354
47 10354 -17490 -5522 18985 -5092 -7904 3882 1496 8540 -575 -14247 11717 7695 -16007 4259 12015
62 12015 -7284 -9679 1468 5718 -1857 -10733 -7367 16766 3942 -16002 109 6615 -2056 -8359 2749
77 2749 12024 -521 -12265 1917 12464 -6403 -9969 5307 37 -4323 -2755 -234 8028 -4307 -12006
92 -12006 6780 12608 -8026 -3214 13226 6376 -1551 -5331 3072 14556 3496 -5455 6830 9237 -11455
107 -11455 -3811 7571 3285 -2379 -3937 6064 3107 236 -5943 16419 5084 -10199 4383 8087 -2702
122 -2702 -3014 -2896 5199 6886 832 -5311 9283 2191 -12658 -1215 14801 2127 -10012 -2795 7687 1753
138 1753 -5780 2022 9753 3403 -13395 4797 7674 936 -4338 2586 7678 1031 -12028 6672 6516 -3827
154 -3827 -8310 5444 9875 -1228 -11812 -6170 2893 -2190 -13567 2083 13698 -5571 -15936 3425 2932
169 2932 -4587 -11192 2771 11954 -10014 -5084 10350 5755 -3392 -258 5991 -3457 -2581 -4615 4353 10861
185 10861 -3265 -11703 6306 1881 -12529 926 8563 3892 -3013 -7453 15075 867 -11386 -8749 8746
200 8746 676 -6205 -2018 5362 -2467 -8942 -1796 6677 8231 -6792 1126 13908 -2467 -8916 -2696 158
216 158 11704 -9824 -1277 9963 -5339 -11090 3055 8951 -2344 -1184 -3474 6018 -1992 -8590 5480
231 5480 12813 -6625 -8852 2330 -1021 -4577 2471 2825 15128 -2620 -7547 1410 2215 -5043 -7687 6556
247 6556 4925 -2308 -901 2431 2463 -3038 -722 1132 93 -5087 -5549 10984 6888 -3685 -3470 -625 770
264 770 -2766 -1857 3284 -576 -2435 -777 8662 3194 2673 -2713 2519 230 -6279 -2465 -271 -202 -5358 -3815
282 -3815 7419 -7632 -3840 1223 612 -3331 -4868 -877 712 1654 -1038 -1763 592 1415 -3411 2830 974
299 974 -799 -72 1238 5708 6148 -10428 -1318 3893 3329 104 9280 -3987 4340 -3087 1082 2927 -1449
316 -1449 -2030 1354 -627 -3016 5469 3098 4186 2659 -2475 4636 15154 -4144 -767 4152 -1999 -5569 3641
333 3641 -1116 -1242 551 -2127 4754 -5086 -1294 3020 -3311 -3285 -258 -2010 2640 4445 -3090 -855 5626 -1230
351 -1230 -6288 -5281 4131 651 -5866 2593 1014 4212 -4759 -2503 -1506 -5567 -2919 4178 6774 -1295 -3091
368 -3091 420 -2424 -1206 9229 -6182 1982 3041 4005 -266 -587 1995 -6780 3726 5196 210 473 -3650
385 -3650 2152 -1126 230 -321 2737 1125 3798 334 -1510 -5368 -1891 -2350 2077 3280 1196 1628 -229 1808
403 1808 665 1892 -3463 2844 -2582 -2250 -1338 2650 -609 -2629 3302 -2529 -1078 -857 -436 -1407 -4790 -679
421 -679 -1415 851 -469 464 -980 -1247 3461 -1606 4680 7673 388 -8307 1277 1448 -2079 -58 2970 -323
439 -323 2243 522 -1689 3130 -5335 -7386 1224 322 -1866 -983 2056 259 -3930 3654 1221 1891 898 -1839
457 -1839 4119 4655 6645 1027 2371 -176 -7644 2000 281 4821 -1821 -3514 1396 -460 -2799 4097 1824
474 1824 2222 -4205 -586 8048 3980 -5174 -4610 -5743 -6458 -5349 -965 3209 3672 -450 3619 -2585 4426 -2886
492 -2886 -3918 2625 6713 -850 4902 1108 3211 -2529 -9320 5605 6437 -6746 7286 3908 1048 -1496
508 -1496 -2403 1386 967 -5226 -1680 5409 -4934 -954 -6850 -2696 -2045 -1921 -3620 67 -2575 -7815 3148
525 3148 2447 3127 3400 501 729 -1066 -13328 -1586 6792 -5600 1144 2966 4912 -3688 -4577 -1804 -3318
542 -3318 -1971 1320 -741 291 -742 -4340 3863 1010 -6212 -2587 3215 2221 -11718 4091 4842 3885 -1234
559 -1234 -4161 1582 2374 -2444 4319 4921 2368 -3863 -2980 1903 -1214 -4465 -684 673 -2975 -1560 -1158 -456
577 -456 777 1373 -5821 3126 -2945 6021 -6415 1402 831 59 3081 3367 1902 -699 727 10820 3229 -1759
595 -1759 1179 1898 582 -2640 3004 3480 1852 -1738 -7257 6265 4011 -7565 -1676 -470 -7557 -3043 5888
612 5888 2570 5180 -5994 1905 859 -8589 -2339 4049 10911 -3214 -1627 -2085 -1642 -8104 2135 -3197 336
629 336 1145 1167 -1041 3557 -1438 2664 -1084 -2688 -3724 -3704 357 7130 -1907 -1290 7951 499 -387 495 -2428
648 -2428 3605 -2478 -6182 3767 3372 -277 -105 2057 -6793 -5115 1110 2208 1134 -2742 -801 8121 -4526
665 -4526 560 -277 -1333 -3302 -514 -3834 -1019 -4883 -4366 3756 1778 -4579 -7009 -2092 124 1024 810 2389
683 2389 7109 -6422 -1414 -1059 4596 3993 -4641 -4458 1334 2208 -2741 -1401 6525 -1469 -2104 -4089 5658 206
701 206 -8946 -715 -3767 516 -278 -547 -3989 -1968 -1246 1674 381 832 -9088 5422 2143 -6411 2989 1242
719 1242 1054 -2477 -34 -207 5696 521 2175 2424 1967 -3020 3679 4760 -632 -3808 146 683 1794 -4685
737 -4685 2938 3210 -3053 1463 -3653 -5297 4199 -6129 -3363 824 1389 7789 1167 -1927 249 -4503 -1007
754 -1007 736 6723 -6240 1626 4069 429 -7395 4976 -3446 -1320 -2132 -4865 1879 1759 -398 730 -1125
771 -1125 -4387 -525 -146 -5414 -1109 -1685 1153 6539 10225 -3373 1127 4351 4523 1571 2403 -2564 -424 -2940
789 -2940 124 -3722 -4928 5270 -941 -1223 3186 -3695 -2606 -4406 -1451 1481 458 569 811 -3453 -6662
806 -6662 2385 1591 321 -5609 -4019 -3313 -705 2073 1689 8505 -395 -2316 -208 -1049 -166 -443 4847 739
824 739 -233 -4481 696 1755 1825 2131 1356 -283 -5449 -2165 10033 -1479 -6986 496 4267 8749 321 -767
842 -767 -4146 994 -1267 -3908 3647 -265 -5842 -504 -4393 1747 -5779 1295 5868 -1351 6444 -1519 -800
859 -800 4052 -2458 2349 4973 3547 543 -2803 -6855 -1722 975 -2566 4301 -1691 -4684 -4820 -805 56 -481
877 -481 1538 11099 6722 -2878 -1171 10301 5970 -2242 -2733 6757 5949 -1080 -5348 477 -2056 -6393 1973
894 1973 3744 -3662 -3194 -2386 6822 -6488 -4192 1561 4927 -4347 -4604 -837 6858 3285 5670 -3829 1784
911 1784 -4156 -5121 3736 5580 -2855 -2423 4040 2040 1436 140 656 8952 -1133 -2066 4782 2527 -55 2758
929 2758 4651 5951 -36 -4418 -2449 7873 -950 -313 3243 -2747 -4719 4495 9115 5535 -5982 -3132 4012
946 4012 -3590 6231 -2914 8633 2384 -8061 335 -3081 -3994 -6957 -2789 2198 -183 -5066 -1815 7443 -5533
963 -5533 -3492 -4174 903 -709 -5730 1990 5628 -2554 296 292 2543 2215 -10676 2022 -4611 -1097 -2426 1352
981 1352 7750 -1135 -6411 -1178 -467 -1877 -8594 1980 6942 -2243 -8035 5542 3807 -3205 1585 11637
997 11637 -1912 -7922 -773 12211 6030 -2441 -6749 -3155 6228 -6241 -3010 3590 3937 2594 -3763 2981
1013 2981 4772 -8996 -3831 2567 8192 -8374 -3635 6470 -1775 -4628
1023 -4628
##PAGE= T1=  0.1830664E-02
##FIRST=  0.1144165E-03,  0.000000    ,     -14392,       1186
##DATA TABLE= (T2++(I..I)), PROFILE   $$ Imaginary data points
0 56 -2639 17664 -2347 -16459 9970 20530 -9720 -7965 5733 12501 6915 -12912 -2955 7195 -6558
15 -6558 -10203 15512 9025 -2603 -14812 785 13436 -5711 -15793 2532 12274 -16416 -695 9907
29 9907 -1777 -7719 -6705 3371 10348 -11417 -16511 13825 8650 -11287 1731 11611 2435 -8450 -6454
44 -6454 7359 16683 -13564 -10587 18654 6184 -10183 5278 7268 1126 -1797 -8758 17041 10002 -18853
59 -18853 -8745 22237 591 -10367 94 2055 881 -10269 -9149 12295 1538 -9426 948 14520
73 14520 -8169 -13691 5652 10456 6198 -12836 -5690 16423 -1752 -12460 10950 10117 -5936 -184 -1539
88 -1539 20736 813 -13825 -2189 11090 -9398 -7053 11619 3841 -12702 -7415 -3587 13074 -6212 -15010
103 -15010 10595 8759 -16238 -10283 10265 1345 -7184 -7722 11188 9037 -5452 -15621 15696 9250 -12752
118 -12752 644 10222 1762 -3449 -7019 8745 7372 -6798 -9485 10258 4020 -10712 -1217 7766 -6069
133 -6069 -7605 4759 4520 1573 -13935 -6940 11669 355 -13531 -2898 15145 -660 -6440 -3001 5930
148 5930 3741 -17763 5497 11902 2525 -9110 5231 2302 -2853 -9321 263 10943 -7270 -8865 4178
163 4178 12274 -5320 -4054 9242 492 -3910 -10296 -4027 9501 -10981 -5569 1489 6351 -11846 90
178 90 10136 8812 2453 -7281 2632 6231 -6758 -2860 10384 7557 -7742 -9055 8725 -1803 1125 3
194 3 7887 4113 -362 -6197 7713 8677 -2491 6793 8768 -5 -6921 -8957 10778 3955 -12776 4626 10236
211 10236 2724 -13462 -571 2528 -982 -4338 -2819 10486 -4150 -13535 -4186 9051 1842 -4221 2187
226 2187 6300 -350 -6949 2555 10266 -7931 -4194 -2308 7434 -4120 1231 -23 -603 -648 -194 7580 6055
243 6055 647 -7519 6535 1168 -11133 -5978 2554 2357 910 -2643 5891 3912 -10161 -6468 12781 5874
259 5874 -10651 -3924 7575 -140 -4087 -9540 3608 -6372 -13869 -8554 3295 6711 -613 3858 1792 1921
275 1921 -3559 -4164 4177 6628 3825 -3591 7169 -236 -355 -9708 6509 -2114 -9139 900 2962 4476 -2129
292 -2129 -1076 4532 -624 -269 3387 2464 -1994 -7597 118 14238 1459 -2873 1382 5036 -4364 -4247 3233
309 3233 -1416 -765 -5960 -2425 5947 -1862 -5033 -1884 1680 -3855 1442 8085 2657 380 -7991 -8462 963
326 963 2510 428 1930 794 1236 -5032 1328 1261 -3036 -4481 1616 6974 -2760 -6523 -643 -576 -7426 -177
344 -177 2807 -2797 -1608 2797 -4687 -554 1761 295 -2319 -1887 3365 4798 5844 1608 4009 -1707 -6944
361 -6944 7415 -8512 -1142 4091 5070 -1658 -162 1103 -2374 -5054 2054 1379 -103 -3368 5765 657 1742
378 1742 -585 -7681 2203 3221 2169 321 -7823 3609 -113 1370 847 -3907 5396 -899 -1512 -348 1757
395 1757 -1769 695 -1347 4798 3470 3952 -1154 2425 -5660 -3597 1058 3168 773 -3062 -1398 1709 -244
412 -244 -3090 5388 -678 -5901 3199 -101 -876 654 -5067 -2275 -2495 -463 -3719 -1767 4168 865 -4427 1126
430 1126 -3692 -2986 -10285 -115 -152 -4332 2347 -11318 1827 -373 6882 762 -3207 -4204 -243 10296 3798
447 3798 -5863 8032 6238 -3928 -6727 -878 -574 4069 -4423 7405 5508 5425 2796 3838 9384 1399 -4421
464 -4421 -3259 -810 974 -2257 -5449 4712 173 -88 91 6582 -5209 -4521 -5517 382 -360 -3868 3657 6097
482 6097 7237 -1260 5128 -4151 1845 -4770 -1426 -1377 -930 5950 -1280 -1478 65 -5373 2771 9725 -4995 -3027
500 -3027 2854 3596 -7251 369 -1253 -4714 -4688 -4685 997 -451 3074 -254 4703 -924 -7345 -344 217 820 -722
519 -722 8922 7353 -627 -7703 -9043 3011 -1521 3994 -2701 5395 4023 -3669 2168 -4830 4987 -12417 -2374
536 -2374 5294 -948 264 4884 7070 853 -6844 1401 3571 -3036 -3256 -2432 7456 -2381 -8633 3169 891
553 891 -812 -7340 8103 2049 -11226 -6357 10200 5795 3439 386 11285 1605 -4040 2515 5901 1177
569 1177 -9067 -3053 -740 -2461 -9420 6799 9374 25 213 -1625 343 -3356 -1163 8895 2379 -5707
585 -5707 -4738 2300 -3472 4648 -1044 5547 4163 -2163 4875 3818 1525 -5119 -6882 4410 -1374 3568 -2965
602 -2965 196 4579 -5643 -417 6473 3978 -9680 -11621 7080 4824 2958 -6790 1637 3525 -1174 -2824
618 -2824 -52 -2550 -6627 -784 3112 40 2097 -1782 3672 8498 -3408 3349 265 2520 -880 -633 709
635 709 7135 -366 -893 7273 4873 -2710 -1209 3818 2853 70 -3127 3112 -2585 -8152 -4324 6227 -1805
652 -1805 -4622 2477 -1794 4316 -5763 -491 7375 4037 3722 4003 6628 2047 -2092 1072 3866 7218 -830
669 -830 -3549 3057 1798 4519 -4156 3302 2067 -3003 -972 6774 -3313 567 651 1836 -2817 -1090 -4486
686 -4486 -2200 -3359 -4773 -1989 1584 -2777 -2487 -2210 6674 3578 -1070 1845 -819 3563 -6966 2439 8581
703 8581 -720 10103 3851 3068 987 -5895 -3286 4600 -6814 -1108 3841 4326 -6612 -3927 6059 -3591 1337
720 1337 1514 -874 1271 13 1326 8200 -5135 -649 -4866 -498 52 -72 -3442 3328 -2921 5193 6356
737 6356 1514 -4102 -6298 477 2249 3572 -1387 -1416 8510 -216 -1049 -2269 6906 -3925 -533 -733 -3552 -2583
755 -2583 4966 -306 -2824 -6006 -6433 2964 -1584 6394 -3853 -3034 2655 -3188 6189 -233 2989 -1117 -2642
772 -2642 -1725 2035 -2447 4219 1089 -1164 2638 243 -4467 6746 2510 -3100 756 790 -5517 -1166 -144
789 -144 2990 3379 -735 1257 249 -3602 -3121 1605 1879 2485 5572 7029 1444 1764 2624 -1493 -914 -464 -1575
808 -1575 2181 2523 1727 198 -8766 -1660 690 2422 -1414 2513 2084 -3431 -5762 -4095 6735 -7440 143
825 143 2433 5282 -140 -2087 -168 -621 -2485 -4397 -1714 -1039 2561 -1249 2998 2212 -2533 542 2599 -2151
843 -2151 -2741 3403 -1627 1858 910 -2526 9336 2928 2792 -1049 -3922 7522 5953 -5848 3038 -7312 1223
860 1223 3472 3217 -1693 -3534 -534 -2913 -529 -565 -2302 -2330 -2351 1846 -118 -3878 -3602 -3228 -1832 2116 -861
879 -861 -9592 -3428 5599 6224 -1076 -4921 6746 4135 -5440 4193 1894 -4439 -1511 -2545 -810 7069 -4941
896 -4941 501 1277 1626 -2714 3283 12069 -211 -5822 6136 3211 -2961 -2908 -2958 -4639 -545 8521 6497 2597
914 2597 -3490 -3666 3619 -4302 1744 459 2863 5613 -2382 -3344 2057 4972 -1867 -4238 -3396 -478 -5820 -11392
932 -11392 6407 5098 -2959 3241 6975 -2547 -7540 324 2529 1651 -6781 -1470 -1510 5413 -6323 6097 9213
949 9213 2392 -4532 4392 -665 -3300 -3733 436 9924 3159 -1101 398 4306 2491 -2819 4205 244 4103
966 4103 -14262 -2807 3486 5715 416 4459 8020 -2868 -12015 6034 6292 1689 -11 243 3222 -4435
982 -4435 -3649 5813 2583 -3697 -6760 4819 -972 -7519 -5307 302 2200 -7197 -8912 1277 -2659 -6157 -3060
999 -3060 6845 9761 -10709 -317 9186 1552 -5670 -288 5693 -1494 -4014 -4305 3740 1509 -6867 -8732 10512
1016 10512 -2766 -9547 -1286 635 6082 -1289 -395
1023c95
##PAGE= T1=  0.1945080E-02
##FIRST=  0.1144165E-03,  0.000000    ,      -8588,        297
##DATA TABLE= (T2++(R..R)), PROFILE   $$ Real data points
0 -364 -12083 9231 -3375 -16546 -709 -3317 6031 13145 -18720 7440 18301 -10482 -8362 18100 -1737
15 -1737 -5412 29 -3398 14281 5330 -18833 10459 14930 -19190 -6577 12171 1819 491 2111 -5732
30 -5732 12880 -1603 -17647 8128 15610 -12849 -2963 12409 -3629 -5275 -1670 3046 12165 -4277 -11693
45 -11693 13700 9322 -22833 1341 8826 -5995 -2488 -1931 4978 11244 -4682 -7469 16514 1160 -18020
60 -18020 11952 11079 -7256 -2315 4082 2586 8928 -9719 -6399 24679 647 -19878 7066 8786 -15795
75 -15795 2169 1559 1757 3999 -13173 1134 19808 -9671 -8917 20702 -6540 -8913 6078 -282 6713 1952
91 1952 -24137 9053 14070 -19435 -1946 20856 -12137 4926 -2015 -5155 5749 -3894 -19813 13171 13031
106 13031 -16402 6944 11868 -14046 380 -1019 -2476 21043 -5703 -16482 16867 -992 -26093 11534
120 11534 4350 -8472 4291 1199 -3325 15841 -16792 -3067 21648 -13701 -20390 14529 2837 -10631
134 -10631 2563 -8689 6538 16281 -9545 3371 12277 -14873 -7106 11703 -5434 -4877 4009 -3691 12899
149 12899 5044 -20102 10747 11707 -12864 -2266 12265 -4371 4414 1742 280 12344 -5760 -13863 21195
164 21195 1042 -16200 2233 10288 -3892 2727 480 -608 9276 -6243 -5406 14715 2046 -12897 9171
179 9171 -282 -9646 3694 -7081 941 5375 -15133 -3073 9754 -5241 -8500 -3733 4038 -2222 132
194 132 -6236 1220 6510 -13315 1349 7030 -3606 -3539 5530 1303 -2697 -603 -80 6331 3396 -10740 -1540
211 -1540 2954 -22 -10107 6912 3359 230 1543 -6995 -1134 -1703 -10457 3755 8261 -7575 -1102 6127
227 6127 -6301 1572 -1345 612 4194 6889 -4411 6688 6227 -10880 -1797 4956 -12245 3928 -7502
242 -7502 -7582 18981 2459 -1784 7831 -1911 -9739 6290 2913 -3213 -4773 2456 -3276 14327 -8623 -8103
258 -8103 11535 264 -4414 10699 -821 -5291 9418 -3373 -871 5824 -10141 -656 835 -2960 1120
273 1120 12586 -2623 -1370 6463 -5439 3904 3135 -11461 4441 7931 -1173 3449 478 -3469 5494 -2731
289 -2731 841 2960 2430 -5428 10718 4584 -8326 -2554 1992 4860 -6893 -2445 -98 7264 -5787 -4373
305 -4373 -1010 2484 -1788 -6719 340 4086 -1544 -3537 -3854 1348 -4019 677 1881 4673 1538 2844 -1052
322 -1052 -2321 4403 -1221 4483 309 747 -5099 2109 1745 -4390 -1978 8281 -2757 -881 -592 -3387 -1860
339 -1860 -4062 -7009 175 -1115 3449 262 2334 -1441 2292 46 6632 954 222 3361 7662 -5365 -7497
356 -7497 -997 -801 1603 1029 5251 4668 -4406 1501 -5617 -1000 -1452 1199 -7186 -3077 3088 2660 3443 2988 921
375 921 -432 6559 4836 27 3208 4405 1980 -204 -2707 700 4888 -855 2695 -1947 -2071 1834 2310 -2810
393 -2810 4317 -85 -526 4193 -6297 -3722 1848 -3148 2649 4057 4802 -6519 -2589 2551 2382 2992 807
410 807 976 -3662 -4086 -2848 -3168 604 -2251 -755 -6240 2596 -1050 -772 -880 -5272 390 -450 1378 -2813 -766
429 -766 -4269 1336 410 -577 -2231 4416 -3356 -5203 4592 2107 -1934 -3860 2134 -1874 7300 -2958 -3522 -1680
447 -1680 7200 5982 3250 880 1293 -3890 987 701 3685 -1774 -3076 5701 1919 -803 -2094 7155 -1447
464 -1447 89 4347 6955 -1053 2238 6139 1445 -1959 -3 2461 4668 5771 -1994 -858 -1146 776 -3494
481 -3494 9340 1684 -2163 504 4933 5034 -1811 -4891 9524 2514 1967 1222 -1483 2562 -9025 3603 784
498 784 -102 668 -969 2316 4364 -1473 4201 6868 -7772 1765 7338 -7676 -1963 -584 3225 854 3997
515 3997 -13045 6407 10115 -4887 6156 1361 2156 2271 -2724 -1150 3443 -1543 -776 2224 -3142 -3141 3246
532 3246 4324 2419 3001 -3136 6560 -1689 -4748 -4638 7020 -6344 2241 1590 -4132 -5791 4081 -1373 3114
549 3114 10509 -5110 329 3676 -3585 -161 -2672 5609 2424 5679 2175 3833 -3268 -1455 3330 11828 2042
566 2042 -208 1023 3989 -824 253 4347 5282 3445 -1917 2722 3592 -2446 -5894 7281 -2550 1651 -4340
583 -4340 -1653 5481 2815 -6287 -6679 136 1528 -1400 1236 2533 1613 3083 -2264 1395 -2119 4141 9715
600 9715 1123 7143 2240 6878 -6080 -3876 -4994 1961 6803 -2954 -1046 -5358 2249 -1974 3204 -1857 2393
617 2393 3427 2372 333 3564 -4872 -3248 4674 1828 -5793 2317 -2325 -282 3274 -3513 6214 1439 -6381
634 -6381 172 2640 382 -2992 -1122 -6949 -2599 3315 -1462 617 -999 -771 -2059 218 -763 838 -5066
651 -5066 263 3804 -1683 -5110 1041 4821 -4703 4736 -3223 -4685 2854 4481 -5116 4499 -1348 -10643 1616
668 1616 -595 -5471 2432 -519 -117 4349 -3826 -2383 6510 1971 -4169 5169 -5821 1738 5134 -409 -2927
685 -2927 -81 -4358 3545 -316 -2623 -956 -336 -1368 765 1181 -4871 5026 -3726 2658 4740 79 -813 2255
703 2255 316 -4144 3525 4393 -4586 -4106 -3129 -1828 3577 -5588 4823 459 526 -5337 -4819 -1098 2362 -4502
721 -4502 1760 -511 5538 -1941 3163 -9 167 -684 -5391 3529 -4282 1448 3372 -497 6192 1043 1905 1671
739 1671 -6108 -1781 -650 -260 -410 -5593 6387 1685 184 2121 -1978 -3962 3248 -324 13445 518 5324
756 5324 6580 -2535 -2671 -4018 -3414 333 -1212 -4738 -1205 5140 927 1204 5956 3441 3093 4038 2088 -1892
774 -1892 -2656 -6169 -2579 972 1288 -1277 -3067 -5374 1276 10420 952 -3741 3505 1527 -2605 3996 2453
791 2453 4088 -1165 -4138 9920 -948 948 -2036 911 2403 854 5596 -2311 1684 -10170 312 2754
807 2754 977 2758 608 -1514 69 2652 5127 -834 665 -63 918 -4097 -4423 3643 -4398 2534 -244 -2483
825 -2483 -3406 7232 -379 -4557 2427 1165 3897 -5501 1270 286 -2611 3242 -5333 -213 2222 -283 -7359
842 -7359 -1904 6906 -1276 -2596 -2351 2974 1014 636 -1314 2105 -3415 2392 4794 3657 -241 3420 -7776
859 -7776 2009 -250 -533 -3560 496 518 -814 -2914 -690 -4785 -1104 218 -922 -8582 -156 5349 -3825 -9329
877 -9329 -2196 -7322 -1170 -4891 1663 -1250 -1288 89 1595 5453 5225 -661 -5464 3318 8002 -2469 3030
894 3030 4739 -5254 -950 -1067 9831 -3466 1732 1825 9054 1467 -4475 -213 275 1109 2806 -830 701 3555
912 3555 -4615 425 3600 -5052 -2907 1684 -383 3642 -6686 3777 -444 6363 -6438 -5840 5614 -3700
928 -3700 -419 2547 645 -2339 -3313 -497 4433 -1996 -7159 5742 14045 -1799 -9212 5868 1783 -3803
944 -3803 -1026 2436 6071 -2847 741 7923 724 -1391 2222 201 -1812 -2653 -1395 -6697 -2083 -3758 2338
961 2338 4883 -3307 -1735 3855 4004 1653 -1552 -7675 -6 2775 -9290 -3669 2128 -2463 772 73 2662
978 2662 3514 145 -2586 1925 -780 -6020 1854 3157 -2368 -2675 4115 394 1836 -6018 3010 6406 2840
995 2840 -4773 10302 -3144 801 -3292 7344 3573 -6926 -117 5418 620 -1231 2041 5356 -1003 1234
1011 1234 3377 1330 3267 1535 -1745 1365 5053 -13488 -5658 3536 -2759 -4147
1023 -4147
##PAGE= T1=  0.1945080E-02
##FIRST=  0.1144165E-03,  0.000000    ,      -8588,        297
##DATA TABLE= (T2++(I..I)), PROFILE   $$ Imaginary data points
0 14 13056 5890 -9123 -2490 -1706 1472 10376 -10111 -4745 22496 -8153 -12848 17894 4035 -14587 7383
16 7383 -2052 3884 10931 -15156 9430 18792 -8864 -10290 13224 -725 -15087 4052 -685 8586 -319
31 -319 -17004 8222 16540 -23342 -12492 16903 1019 -9575 2508 5496 3672 3645 -6207 12940 11839 -18650
47 -18650 -2523 13474 -5831 -7872 8641 9599 4894 -4125 -13090 12851 12210 -19139 1552 16589 -6753
62 -6753 -8121 5249 6346 2102 -10278 2405 15329 5871 -13577 820 14146 -15931 -5785 10235 688
77 688 9130 -17578 -10236 17519 -5604 -14805 21322 8651 -14164 3983 1796 1728 7898 -11703 -933 29142
93 29142 -16968 -6865 28696 -2164 -10611 5953 -7711 1203 4005 -16152 9093 22934 -27138 -5086
107 -5086 20469 -12657 -11739 3606 -8840 5890 561 -25304 20783 14112 -27103 8031 19220 -12457
121 -12457 3184 3178 -13764 10597 -7520 -14097 29577 5122 -21934 11123 4015 -8154 7338 -2318 -3920
136 -3920 14796 -8537 -12636 24341 -1371 -14767 17667 -3619 -4791 5881 -17521 2420 11552 -16442
150 -16442 4119 18223 -10187 -3067 8708 -7316 -75 4397 -8382 13262 2370 -18329 14137 10600
164 10600 -17466 -2003 14467 -5765 131 -1151 -4348 18768 -1844 -16120 15681 3491 -20013 5264
178 5264 10672 -4201 -305 -8757 189 7741 -3807 -9330 17702 2650 -14902 -291 5736 -7049 6027
193 6027 5512 6621 4493 -3415 -4275 3876 2423 -5473 9489 3048 2183 506 -421 1201 2306 -11740 -4894
210 -4894 12267 -1192 -7467 2645 888 -4819 -792 -4689 -1085 3409 -10688 -2871 1672 -2739 -7705 6530
226 6530 -6081 -4521 -8184 -3947 4606 4728 -13614 3730 10704 -9814 1215 4771 -5512 289 -5450 -6556
242 -6556 330 4000 -10717 5357 4436 -13439 -131 -1185 -5128 5789 225 -3904 9832 -4378 -14809
257 -14809 19440 6400 -9781 7010 -4220 -4230 7092 -706 2140 9627 -10355 3110 13870 -6449 452
272 452 -2345 -2353 2709 5191 -6930 -547 8265 -6841 1673 4861 -11668 2570 3446 -2514 8246 1855 -925
289 -925 5188 8691 -2458 383 6060 1619 3770 7529 3411 -859 -2491 808 6981 3424 -5093 470 519
306 519 -5514 8596 1383 -5295 -9421 -3451 -504 3836 -1252 -8860 519 -1481 -4039 4919 5347 -6199 1130
323 1130 -5838 -5916 -2069 5542 -6565 -902 -2353 2562 4915 5387 6028 1428 -2872 5043 -941 -893 1853 1538
341 1538 4090 -267 -3301 -4785 -5889 -1532 1926 2749 12117 -4055 -1554 9504 2543 -5527 -5234 -140 -1700
358 -1700 -2908 -5937 -3793 -3293 631 2392 1935 246 -4023 3738 2891 -1555 1434 -2759 -1631 -2804 -3706 -4612
376 -4612 -2111 -3357 -369 1280 5360 1780 4255 1582 -3050 291 965 4843 -894 -3619 -6189 -7259 -4474
393 -4474 5666 -4221 3540 5489 -996 -1607 -2308 -3991 1583 -2581 1878 336 7898 -2287 -129 -1614 -1443
410 -1443 -3294 -10654 3549 1848 -183 4783 1970 2807 -1732 -4149 3193 -193 -7430 -6662 2984 4162 -1427
427 -1427 4880 -5482 428 149 -6185 6416 -158 -2042 -3436 -206 2899 9830 -473 6729 4657 -776
443 -776 -349 604 4975 199 889 -5109 5758 -5187 -67 3395 -3773 802 2034 2641 -6432 -2916 1868 305
461 305 6341 -4027 -9060 -7879 -1949 3304 3134 1589 -1680 -1690 -60 -3366 2663 -658 -930 904 -2034 2377
479 2377 -3750 179 5501 -6964 -5604 1588 451 3141 -1341 -6156 3272 -2063 1444 -2630 -620 -4796 -2552
496 -2552 -2082 -1342 -6267 2243 7813 7589 -11065 6765 1964 1 -7212 5950 -1587 -535 3520 -6095 2706
513 2706 2736 -4179 549 -7046 -9534 -1885 4801 -1052 9367 -3138 6457 1298 1228 -4080 3786 -120 -3839
530 -3839 3285 -892 7018 2658 -4800 -7907 8718 -3463 -3161 6523 786 -6040 4877 5993 -2975 -3142 125
547 125 739 10538 -2475 -1646 1843 4037 3052 2168 -2200 760 -1135 -797 3585 7739 -3623 1944 5117 2346
565 2346 -6115 -10211 1260 -1447 5287 -1388 -2733 -4117 -3290 2268 8085 -1603 -1182 4390 1512 4994 -3501
582 -3501 -2042 -3407 2764 -4462 3258 4649 3832 -638 1190 1500 4149 -4555 1032 -5139 1605 3537 -459
599 -459 5384 -2398 -5210 -2903 1070 4764 -3440 -4649 4655 962 -8306 2874 5100 -3508 -1183 -4589 1140
616 1140 518 -124 5175 6443 -5535 -8111 3447 5765 -2207 791 1352 -4981 -4344 4919 -1478 496 -834
633 -834 -6015 5516 -4416 950 4137 -1295 206 -1975 -1695 -426 -1472 -4614 -403 10886 -1808 -2946 -2614
650 -2614 -4702 3734 5083 -2094 4348 3247 -402 -94 6794 -6987 5088 1927 2606 435 -1464 3197 2561
667 2561 565 1830 -4519 -2702 -2812 -6048 9938 1909 -4017 -1934 -2455 7136 -5341 -7294 941 113 -11446
684 -11446 1024 74 4436 6140 1071 -1142 -3404 -1620 1105 7958 3438 -5927 304 873 4603 -2750 1349
701 1349 1949 7901 417 1540 5818 -4897 5223 -3246 -3893 5196 -6136 -7387 -4180 674 -6922 -1500 3923
718 3923 -6261 3474 848 -4158 1240 -1473 -3754 -1464 445 -204 -272 3879 -281 -2562 7331 -660 -6870
735 -6870 -1622 -3821 1472 -2884 2105 -3282 -344 -7034 -1335 -69 -332 -828 2024 -4342 3219 -1265 -4506
752 -4506 -3560 6526 -4034 4335 -1119 2339 -1245 -682 -4825 -9483 1570 -3395 2110 -1118 -6097 -1798 241
769 241 3193 4687 -5895 -6478 2968 51 4576 40 -3103 -3635 -6042 -1682 613 2812 -3709 8475 -4193
786 -4193 -1259 -2366 725 427 -4225 3261 2227 210 -1951 -5951 2618 -2862 13699 -827 -69 -1134 1491
803 1491 -3269 -250 -836 -3964 -2069 174 2436 -222 -2951 -5117 -2406 -3387 -3668 -4351 2847 -8893 -859 -4125
821 -4125 6784 -4915 4088 -426 39 -7587 2705 -4357 -7214 4397 1137 -684 -81 -4145 -3032 -4812
837 -4812 -7325 6700 -958 -3671 -1339 15035 902 -3822 -1648 -4602 -2378 -2333 -3162 702 -3157 -10963 -9590
854 -9590 3388 -1874 -2463 -7 -4351 -3104 2700 -325 -2676 -4466 -2545 4597 -2865 2809 1816 2247 4433
871 4433 1841 833 4140 -1474 -2275 -6251 -3390 1000 4353 -3280 8130 -215 2359 10451 2209 652 -8972
888 -8972 1013 9282 3690 -10182 4128 -1521 -5133 -1042 203 -1634 792 -1720 -8049 -3264 2769 -7151
904 -7151 5756 3556 -3771 4227 6450 -4089 1998 -4183 75 6283 -1096 -5785 7400 -429 -7511 -696
920 -696 -2203 2781 -734 -9053 3005 9960 -2648 -5748 3773 -350 -1211 -1153 -1910 12441 -4269 -8915 9300
937 9300 198 -5180 -1719 -701 7243 2902 1777 3848 -7104 -2405 -7974 10091 2852 -12986 -4258 1395
953 1395 -332 -6755 -2135 -9 3778 -2108 -256 3239 -771 -3293 1560 3156 1526 -2380 -1518 -4378 2806
970 2806 -3786 2077 1806 -2675 -2698 6476 11160 -2868 -7431 -3246 10119 1658 -12310 2688 659 -7947 -7675
987 -7675 -3240 208 5082 -3143 -7051 58 5003 -5431 94 9932 -7773 -4182 -2142 8727 -2048 1110
1003 1110 -27 3708 -78 -3215 2930 8647 -651 -5448 9653 4027 -10978 143 -1571 978 -6217 617
1019 617 9023 4141 -6563 -12252
1023 -12252
##PAGE= T1=  0.2059497E-02
##FIRST=  0.1144165E-03,  0.000000    ,       -637,        403
##DATA TABLE= (T2++(R..R)), PROFILE   $$ Real data points
0 -27 -5233 2253 -5553 -9320 7593 -3570 -6177 4683 -2986 -2176 1556 -1067 74 3908 -58 -7329 2929
17 2929 -5975 -357 12286 3897 -2656 6417 946 -2307 -899 3159 1176 2148 -3435 -1733 4026 -413 -1522
34 -1522 405 -1826 -5010 -4588 1801 320 -2835 -10118 -6619 2461 -3396 -2499 -676 1843 -5389 4372 1499 857
52 857 -4532 3459 3729 -499 -5116 3449 -4704 -1649 -193 -1918 1780 4767 2492 -976 4288 -2239 -5369 2926
70 2926 2762 -2389 3402 851 -7831 6908 7643 -3143 6539 -1732 -6294 3004 825 -498 2846 -2257 -5725
87 -5725 6302 -1033 -9179 4887 -1958 -2315 12331 -3514 -3555 -2303 4391 2475 -1772 -4184 3271 -285 -8853
104 -8853 5536 7020 -5916 -955 3545 -3281 5919 1840 -6794 8448 -5076 -6890 6563 -147 -5197 498
120 498 3009 -11426 4920 -17582 -9461 2240 327 -9075 2398 -4769 1393 -975 -8887 2329 5440 -13088
136 -13088 -43 4980 -305 -2506 14280 -3589 -2077 5105 -2103 1699 -4095 -9765 9187 219 -4968 5108
152 5108 2705 -542 5670 151 -5038 5803 -232 -6298 4768 2342 296 5341 -2449 -9608 65 1030 -1295
169 -1295 5129 -5581 -5242 842 -494 -4748 1764 1340 -1171 2131 1 1450 -2042 -6391 321 2734 -2190
186 -2190 -2885 3454 2317 6457 -2278 -3800 8998 368 2404 -1341 933 -2832 -1695 2572 -4570 -3092 -1210
203 -1210 4405 9685 2995 -9133 4928 4053 1535 1963 4088 5692 -1339 3092 -5223 -2238 -1228 -3857 1957
220 1957 4694 829 -2482 1262 -5823 -1142 2094 -1827 -3456 -167 -9882 -649 1558 4301 2280 -159 -11287
237 -11287 -2982 2943 1995 -2262 632 1097 3601 -1014 -837 5990 6652 -1263 -529 -5558 -695 -1952 1336 -5605
255 -5605 1813 -9940 -2606 2062 2709 3455 -6230 -4023 179 1778 -1458 2870 763 -2891 4290 538 -531
272 -531 3329 -8683 1320 -839 -9340 1844 5262 5357 -7946 3713 -1717 3585 160 -5325 -5304 3804 2484
289 2484 -3316 467 -5222 835 3607 -5693 -457 -4140 4185 -4370 1671 -2585 5930 4605 -6518 2086 -769
306 -769 -1539 2680 4161 -3935 2052 -33 4120 1076 -953 1837 -3358 2525 -10558 1014 -2773 3686 -515
323 -515 -4753 -847 5866 5659 1850 3924 2583 -721 -2409 -4942 -2108 481 4328 -39 3943 -8936 -5872
340 -5872 872 -1557 -2794 -4134 3471 -807 -210 -4443 -582 -1189 505 -162 1131 -6393 -1789 425 5927 4664
358 4664 -702 568 -3275 4450 -2222 -265 -1550 3190 -2265 -1113 -2101 -1671 2635 -1107 -2036 -1579 -5258 3706
376 3706 3295 1204 2314 1739 -2714 2051 -4343 4098 -4502 1653 649 243 5230 -1391 -6576 -4571 9256
393 9256 1109 -2754 -4299 -3460 4338 70 811 -9817 -1100 -1112 6195 949 3276 62 127 -64 7891 -1885
411 -1885 -3176 2805 -6168 5495 -939 -560 781 3785 -2221 4066 -938 -3352 -8284 321 7109 -3671 3424
428 3424 -9806 -5987 -72 1644 -994 2184 -2104 1134 -1261 -5447 760 -2203 -3111 -421 -43 668 -3275
445 -3275 1181 -55 1319 -2189 -3281 -6601 6758 1938 967 -4157 1760 -4816 -6561 848 4379 1617 3153
462 3153 2996 -3579 6760 6779 -481 -3179 3286 -865 -1547 1245 -1298 2766 6007 3584 4072 -373 -60 3959
480 3959 -247 -2157 454 -4566 -3071 6754 4948 -2424 82 -1372 -5460 187 -440 6261 827 -741 5212
497 5212 -265 -980 777 520 -2754 -7451 -5610 4212 -1359 3446 -1554 686 1347 3136 3113 -7089 3294 -1448
515 -1448 -2200 -2587 -1449 -62 2724 -4328 3535 -191 440 -3663 -1464 -6245 1142 -460 285 -3979 4331 -2555
533 -2555 4198 -6852 -3730 6909 -3845 971 -4234 66 395 149 9608 -7835 -2078 4371 4082 165 -2424
550 -2424 -2180 5727 1207 3017 -104 3500 -246 -2756 -3574 929 4310 2912 6289 2369 -557 -280 1226 -1344
568 -1344 4958 2018 -3537 -1678 7595 2212 2433 2604 2778 -6900 -2179 -4347 2040 1306 1373 1478 4477 1954 3035
587 3035 4494 4145 1104 -120 433 36 -1884 2638 6847 -5816 -1696 -1826 -1671 -2574 -336 2437 -902 6170
605 6170 807 -3881 -1642 -2464 -256 -2105 794 111 -3198 1398 3042 -2518 -3346 -173 3087 -6960 200
622 200 -4687 5247 -2908 152 -1261 3735 3012 10599 -2556 -4640 -402 4890 -1605 -1560 1015 4018 -2586 1204
640 1204 1468 -2043 -357 -1379 -4933 -5565 4737 1202 6935 3965 3827 -1661 -708 -189 3002 -1007 -1266 -9
658 -9 -6798 -2262 2423 -3695 -3325 3839 -2858 -2958 -2193 -598 3993 -1377 -1441 -3402 -1811 2795 -1870 823 2918
677 2918 -2372 778 -7624 634 465 -6140 -2713 2784 4928 -2702 -764 -373 -23 2017 -645 308 -4984 -2697
695 -2697 1338 3140 -4996 1367 -1042 3439 -5325 -1380 3726 -3065 2459 4507 -3671 1166 -3552 1868 479
712 479 4931 -1556 -4224 -2452 -2431 -46 -390 4378 481 -2366 -3142 -928 -5402 -153 -8783 2486 -2503 -225
730 -225 -2896 -110 4800 5534 2303 -6732 3063 -4634 -2325 1261 -4240 140 -410 -4640 -959 1561 -2263 -4311
748 -4311 5397 384 2030 1114 5664 614 2197 -1479 487 -982 867 258 -2900 -1515 -3210 914 -756
765 -756 -911 1789 -2000 5989 -1163 -7850 7181 3758 4033 -1761 1106 4290 -2461 6585 -1862 2383 847
782 847 -364 110 -4438 -2668 -863 4306 -2111 -1798 1256 -806 288 2416 541 4596 -49 -1478 -2669 5308
800 5308 4015 -2332 -735 -641 3124 1944 473 4788 -1017 2607 2217 1549 -3316 -3063 616 -500 -3971 1659
818 1659 473 -32 383 -5580 4004 -692 1114 -2209 -3193 -1815 -3899 5383 -802 6433 -1983 554 -4022 -602
836 -602 666 -976 2124 -349 -8831 -3745 2606 -1622 -310 4815 -1200 -2272 1789 142 253 1103 1398 -494
854 -494 -7716 -3762 5120 2396 -151 -493 -3365 -1239 6479 -764 -628 -587 1965 -4053 1666 -5960 -5429 -6191 1708
873 1708 7676 1379 7783 6053 149 1517 4308 -1965 -7524 -1911 11265 4056 3348 2435 3712 -1032 -1760
890 -1760 -2148 2756 6363 -2970 -1748 4196 -6410 1878 -1129 528 7394 4492 -1814 1830 -1711 -8468 5694
907 5694 2433 2120 -5613 -691 1452 -2843 -694 2603 -1334 2025 -1790 -2775 -322 -3965 -1092 2193 -626
924 -626 -2144 -1187 -497 6607 6062 -2844 -3664 3235 -1500 -3722 931 77 -2082 3608 1921 2297 -1350 -2893 -3906
943 -3906 -5991 -5197 -6904 -1416 -6606 -6793 4530 1771 2281 -6532 350 1217 -3334 -2732 -4337 1470 2214 1615
961 1615 -2732 -735 -2069 1288 3263 3335 -1399 2692 148 592 -1619 7803 422 -1081 6722 -3207 -3405 1173
979 1173 -2407 -2342 4432 -866 1627 4877 7130 3207 -1448 4996 -4397 2908 -2961 -212 -1232 -5395 634
996 634 -1768 2167 2653 -4524 1695 4515 -1820 -1877 -3374 -3307 -2572 4351 -2115 -211 3695 4639 137 1243 2183
1015 2183 2308 1032 -8119 6539 4578 1158 449 1648
1023 1648
##PAGE= T1=  0.2059497E-02
##FIRST=  0.1144165E-03,  0.000000    ,       -637,        403
##DATA TABLE= (T2++(I..I)), PROFILE   $$ Imaginary data points
0 19 5335 2522 -4315 3657 -96 -2068 13315 6030 -16038 4200 2268 -3821 7597 2170 -2646 8613 -3579
17 -3579 -3272 8536 -2595 -14701 -547 -1156 -2457 11142 -352 540 7460 4447 2881 6353 -906 -1406 -4378
34 -4378 -3524 6776 593 -2502 -1943 -8754 -376 2079 -4174 -4107 500 -3937 -1454 1685 3973 -1032 7944 -3280
52 -3280 -7535 918 3818 -2228 -3481 3073 -953 -3383 4199 6142 -1250 3070 -5990 3586 -2712 -7218 -6431
69 -6431 8003 -5958 -912 1227 -4509 1739 1205 -8569 1141 6332 -2179 2641 3042 -3227 5053 10619 -6862
86 -6862 2171 3129 -4753 8477 2830 -9462 13942 4745 3602 1732 -1880 -6937 8634 -4127 -2197 8589
102 8589 -1814 -8813 7761 -10759 1355 2677 -1015 4318 783 -2376 -264 -5187 -14087 650 472 -531
118 -531 723 1248 -1000 5120 -1520 -6495 12899 -595 641 904 -2331 -2337 4564 -2584 69 3776 -2818 -540
136 -540 8930 -5408 -6398 8886 94 -1158 2615 -4975 -688 2548 -5150 -2728 58 -9252 -1511 9463 -4222
153 -4222 1 -1227 -3844 5130 4415 -5190 2340 1390 -1249 2515 625 -4178 -4803 2881 -1914 2199 -1402 -2923
171 -2923 1281 -7602 -6725 4687 9238 -4734 -1274 5601 -1577 2961 923 1517 2412 -1306 810 3134 -6531
188 -6531 2011 5189 916 842 5413 -133 424 3784 -8147 -9480 1444 279 -3349 4846 -2286 1337 8913
205 8913 -7674 1941 4810 -3766 4446 -197 -83 -4705 -199 -2310 7603 -9060 -1911 -3041 3921 -3384 -7058
222 -7058 2555 -1123 -731 2826 -1130 799 1008 428 -2843 -5700 -2632 79 2410 5161 -784 2185 -1501 782
240 782 -1157 -5982 2591 -1585 -424 5672 7320 -297 -866 8128 -2553 2929 -1638 4172 6125 312 996
257 996 2088 -3144 -9509 -3331 -2074 3959 2964 -989 -2850 395 -4190 3796 8711 6864 -4079 4611 -6238
274 -6238 1527 -2773 -5530 8661 4857 3844 1642 5909 395 3011 8672 -1413 11833 -2651 3206 706
290 706 -833 -1681 -2370 -7428 3007 -351 -5434 1024 -3601 -5880 5679 10142 -6482 6779 -215 -12247
306 -12247 256 4133 -5600 2840 -2593 -7587 3631 750 1063 9000 -757 2729 -88 6022 -2500 4551
322 4551 -5781 -745 3915 -2014 508 1413 -1660 99 30 10064 4097 -6449 -1289 960 6958 -5190 -4898
339 -4898 3880 3078 1824 6672 2738 -7550 -6036 -2036 -8056 -2153 -5597 -3162 1298 -5889 -6205 -438 3227
356 3227 8390 2148 -5773 -1903 2319 4622 5326 -338 2598 -840 2644 -2426 3083 -4541 -4576 -3003 -1652 -1791
374 -1791 7901 -3079 -5577 667 4175 4389 -2810 2844 -1598 5157 4947 1934 848 -3096 -2216 -2336 4566 84
392 84 84 2700 -5972 -970 -4796 -1078 5578 4182 3953 -7895 4102 1352 4999 4141 -342 2310 2081 4879
410 4879 -4214 -4796 8167 -2526 -4104 -3142 420 8215 -1258 1626 2004 377 2776 -4044 1526 3842 -5044
427 -5044 1495 -5197 3870 -1054 5391 -2162 -9723 4031 2280 -4428 1010 3054 -70 -4584 1542 -9534
443 -9534 5208 203 -6912 -2999 -2341 4026 439 -1783 -1392 1534 -565 2530 5957 1276 301 -1631 -2057 -4062
461 -4062 5256 -7075 7556 -7079 4204 -7232 -7604 -4055 2864 -3430 -1880 91 -3669 7752 -249 -1643
477 -1643 -586 -4932 3685 794 -6393 6876 -6873 -2394 -912 -5278 -473 -7923 -2896 4592 -1359 -236
493 -236 950 -5657 1892 -3232 6552 3776 1838 -1730 -2594 -846 2832 452 1931 5114 -2421 2882 -9331
510 -9331 -3322 -1790 1962 -6002 2514 -504 1161 4077 1092 5147 -2355 9244 -2798 -3613 3267 605 936
527 936 664 -3809 6698 -753 1219 -2010 5186 860 6980 -920 1462 -2485 -63 -168 -2206 1536 2181 -2051
545 -2051 5790 -3808 -5092 4005 -2076 -5444 755 -813 791 -7356 -19 -1909 -2213 -1783 -51 1970 -4073
562 -4073 -4196 2867 -3359 -3591 2425 -4508 7745 4903 2461 10396 3628 4510 -1902 -2576 783 5289 1608 -2120
580 -2120 5246 1611 -1398 10487 77 1280 3328 -3438 1716 -3340 3078 3467 2062 -4963 -3306 5846 -680
597 -680 -5077 -2068 3581 -11565 2036 -1119 1774 6240 336 4226 7106 -4272 -509 2914 -4916 1162
613 1162 -6364 -2824 2786 -1418 3806 -4071 -89 -6302 4041 4655 8390 -2393 19 6933 -5922 3885
629 3885 -3620 -2091 -6713 5734 296 -1105 -4984 -1420 3275 4429 -1159 -1223 -947 -3118 -5709 -1889 2638
646 2638 1594 1155 4526 -7212 -405 -3982 -753 1541 -2014 2291 1334 -8725 6158 -703 -2174 2575 -6133
663 -6133 -3668 -1949 5586 3300 -2670 6743 3846 1271 -2112 2758 3935 -1852 -1118 2668 -152 -2201 2313
680 2313 4868 6672 -8447 7386 1159 -2734 718 -409 1807 3055 7643 5719 5662 73 -4512 -2905 -1648
697 -1648 -7135 -3441 -1722 6760 7913 272 -1691 -5641 -3263 954 8318 2306 3195 2618 3688 5091 -4447
714 -4447 -1743 753 4579 -1780 544 239 -700 933 -466 999 -222 -6933 -1763 -2421 3213 1363 -205 -5624
732 -5624 3392 -1429 3502 -1266 2626 130 -2216 6099 -5262 375 9185 892 1720 2376 -4119 114 3130
749 3130 4705 2095 -4029 410 554 1585 5002 -3511 -877 -829 -3681 3133 -3232 -1052 1881 -2830 -1417 3114
767 3114 1164 -4446 2761 -3126 -4444 -3818 3911 2414 3761 -6459 -2049 -3897 -2815 -1569 3103 -495 9980
784 9980 1906 -3959 -302 2452 -7 -2545 -548 -3674 -3714 -513 -7652 8918 6262 -2491 4243 2471 847
801 847 6077 -2811 -5419 930 -596 2114 5167 -2069 -2249 -1740 -1769 -3602 -1241 -1649 -4904 -4755 -862 560 -4832
820 -4832 1362 -993 7384 5131 -6004 3057 -9372 -5479 -3820 -4296 -880 2409 -4394 -2856 2046 -4935 -693
837 -693 -8422 2713 -7009 -2668 2413 3968 2679 2790 -945 4993 -5461 1265 1468 -2447 -851 1932 -4933
854 -4933 -4558 -2604 2330 -1912 -2730 6064 -1247 -2960 -3486 354 2102 -6987 5118 136 -919 -2269 -659
871 -659 692 938 4966 -2062 -924 3764 2353 4071 -2593 -2856 -5730 804 -3605 5111 -443 2667 -3066 -815
889 -815 -643 -1587 6243 362 -584 7984 -1144 -2130 1642 1221 804 -389 1525 -2536 -486 -1453 5901 -469 6185
908 6185 2410 4545 5734 6271 3723 1819 983 1421 -1622 -2711 -2817 -1295 -2207 -1241 -4918 -2770 -7892 -5817
926 -5817 -14 3250 4504 -3037 -1826 2776 2468 -747 -5434 -4947 -367 2786 2666 4437 1108 6043 2691 1997
944 1997 -2461 392 3480 -4869 3334 -2143 1151 1619 -1004 -6004 214 -1630 1973 2006 8324 -2877 6289
961 6289 -2366 7883 -1794 -4702 -4310 1935 264 -3367 2737 -6920 1114 -6404 1825 7404 -4682 -836 7196
978 7196 -874 -4096 -156 -4118 1866 6432 -6977 1099 4533 -3557 -1377 3831 650 6969 6945 -753 2828
995 2828 1785 -1360 4259 9014 -4948 -463 1974 -7010 -7604 -2253 -4550 4441 2680 -7230 2033 2986 -553
1012 -553 -964 -961 1550 10676 1775 -155 -1368 8965 -1568 -3066 2966
1023 2966
##PAGE= T1=  0.2173913E-02
##FIRST=  0.1144165E-03,  0.000000    ,       1298,      -1335
##DATA TABLE= (T2++(R..R)), PROFILE   $$ Real data points
0 55 8560 -3176 747 397 -1017 5377 -7644 -2328 14442 -4978 -10400 9737 4907 -1525 3286 192 7757
17 7757 11286 -11428 2209 18194 -11693 -5820 5379 1515 5287 352 -2692 8231 -1078 -8417 10122
32 10122 9545 -15195 -5834 10001 -1565 2315 2840 374 6058 -12184 -5583 4751 5045 -13629 33 2212
48 2212 -146 -2444 3059 -3061 2230 -7062 -3538 9432 4402 -12551 20 1302 -5865 -6815 -2379 6202 4034
65 4034 -7404 -2243 3712 -1797 -9596 4739 7761 -2021 -4853 7934 2108 -2072 -6290 4449 10171 -565
81 -565 -6478 9146 10137 -10815 1162 6947 -1481 -2046 -9434 -561 11521 -1418 -11288 12686 8713 -15716
97 -15716 2025 367 -3657 -4045 -6737 4122 9330 -6971 -6055 9426 -1874 -7318 2750 1649 -4496 83
113 83 -8262 -1867 4739 -12845 6797 4829 -3311 -4420 2382 -1139 651 3073 -12552 11009 8991 -14078
129 -14078 2179 8408 -5565 -110 4063 -2991 6391 -5018 -4569 8105 1276 -4272 6210 8326 -8182
144 -8182 -931 -6063 2954 727 -5822 1251 10462 -1476 -7280 7988 7826 -2966 -290 -3644 5023 -3296
160 -3296 -8132 3089 6786 -9432 -3507 6507 274 -4206 -1374 -6380 6433 -4763 -2663 4842 2657 -10594
176 -10594 -4490 6346 -768 -2261 3297 110 2162 4429 -9294 525 323 -5687 -5600 11292 -1278 -5365
192 -5365 6753 -2473 -2549 49 -4189 2499 1289 -3585 -7482 5857 -455 1014 5636 6044 -4391 1866 -7072
209 -7072 10189 4842 -8009 -3715 3755 -1017 -381 7216 -589 -226 1798 -912 4649 2075 -5266 7415 3379
226 3379 -4059 -387 1367 -82 3467 -4248 -788 9071 -5956 -7689 4861 334 -1459 706 3012 7864
242 7864 -263 -2399 -9141 10419 -7918 -3222 8211 956 984 3205 -2962 3488 5731 -7068 1008 7046
258 7046 -5300 -360 8606 -6408 3569 8217 -3118 961 6363 -7026 1614 3436 -12044 7046 -831
273 -831 -5199 5012 -3450 1349 8208 -8313 -9220 8806 -3597 -9214 1534 1469 -5998 -117 -10391 1186
289 1186 -171 -698 -3948 2217 -7973 -2109 775 -225 -1689 -5270 -4761 6083 1820 -4330 -161 8706 -2515
306 -2515 -2237 1989 -4055 2738 1224 -2052 5348 619 -2571 -3011 5512 -7998 -6195 -8093 -1549 5500 -3385
323 -3385 -2561 -5972 -2303 -876 -1268 6845 -3804 -2845 664 -2483 1987 5730 7663 5149 -3224 -10957 -568
340 -568 1341 -817 -132 1046 3067 1604 4432 -1331 3662 -183 -6075 -2690 3343 -5812 3579 686 2023
357 2023 2542 -711 -937 829 -3389 -2451 -607 121 -4416 4207 -788 3572 -3227 5758 -1153 -3055 -5989 -2182
375 -2182 2374 1704 1487 -104 2346 -3075 -1858 -3609 2357 2434 1309 -6096 -594 -3732 -1105 3676 8962 3638
393 3638 -3469 -4765 326 1081 -1512 2733 -1077 -259 -3846 -3681 -4298 -297 -609 -5483 -2241 3493 2792 2818 1570
412 1570 -498 -3152 -1182 -65 121 -3168 3085 2583 6006 2089 -2293 4732 2342 -1286 -3643 -2852 -1412 -5780
430 -5780 -2704 316 469 -447 -1605 -2454 2771 -5285 -2528 423 534 -1597 -2145 -974 3869 589 -682 -504
448 -504 4820 1562 -4631 -165 -387 -1646 195 -2090 -497 876 -4558 -3188 -5520 -2223 -2805 731 -293 -5734
466 -5734 -999 -1070 4677 -3090 709 -158 -4881 -4089 4610 -3934 5291 -1495 -2291 11100 1651 1943 3465 2169
484 2169 -3900 2849 5840 5666 850 -1064 -4148 1195 -793 2719 3005 3316 -2326 1068 -5850 -2380 -1010 490
502 490 1851 6300 -4723 -4 83 5926 -4139 2734 -6682 -40 -99 -2978 -4073 10263 -1127 -5189 3281
519 3281 -2797 -5908 -4221 -4461 -246 5212 -1718 -335 4128 2563 -3123 2410 -456 -6552 -2165 -100 7158
536 7158 242 -2748 613 -545 -2086 3065 5630 70 1986 -5209 -6308 2770 -916 -1833 2699 1290 -3791
553 -3791 -2946 -3394 2807 2891 -2461 -6887 7427 -538 868 -1263 2068 -1702 10049 1731 -3221 357 -5157
570 -5157 -1596 -120 -2140 -3568 7533 4780 -878 -573 -4563 4195 -272 3736 892 1910 -3383 2328 8516
587 8516 -2210 -5154 -1024 8182 -48 -32 -1643 -82 3063 -6846 -2718 2024 -508 -6216 560 217 -7406
604 -7406 -439 -6853 4197 2819 -10417 -397 -2604 -1626 1482 2102 -4385 -2601 -2172 -170 12136 -853
620 -853 807 -197 88 1404 4667 4594 -14 244 -457 -3034 6449 1716 -4231 -520 3794 -1693 2616 3506 1254
639 1254 239 -732 1512 4385 -8061 -2282 -2689 -4783 -3534 6364 2556 -4264 791 -6067 623 2107 -5652
656 -5652 -2453 4683 664 -1553 2098 -3672 -4066 -1401 -829 629 3368 -6300 -328 2403 -2157 -5901 -2552
673 -2552 -1283 -6927 3475 720 28 2104 -4336 -5954 628 -3371 -4108 -5013 -1086 4826 -4856 -1826 3416
690 3416 2912 -3699 -3517 747 -5447 -3079 -5958 261 4614 -590 -1480 4194 -5589 1787 -739 6139 3922 7535
708 7535 1871 -2680 1602 -3906 1379 3663 6099 -3448 2982 5405 -2553 -1493 -3406 1658 3134 -5415 -409
725 -409 -482 1709 -553 638 -5641 -7382 -1288 1199 -3658 -4797 -5704 -1079 4012 -4327 -1693 4172 3955 -6155
743 -6155 1660 4191 885 2238 184 -813 651 -5997 2437 1779 -3931 1518 -2260 1171 4596 950 -3244
760 -3244 713 -3439 2740 -6824 -218 4098 -1348 -1217 -2572 1589 -394 3921 -2745 5 -2975 2599 -3281
777 -3281 4428 -4005 -1403 2396 307 -1133 332 -8246 -6034 3812 -1023 -1 1427 -4025 -6081 -1789 -4697
794 -4697 -2741 -2110 -693 -972 2441 323 -1543 2361 8265 -3049 501 -1944 -2301 -1774 -3229 245 3258 3569
812 3569 1622 -2275 3932 -4680 -1513 -7085 -1422 -3250 -8046 6483 -1540 1069 -3530 -409 -3599 3865 -1581
829 -1581 3227 -978 -2431 -1586 7083 -2039 4500 3338 2812 650 -3047 -357 3505 2479 -6332 3809 299
846 299 -2121 -1537 -844 3818 -1656 -6875 3769 5406 -705 -3295 1928 2876 16 -932 403 1182 4179 -1515
864 -1515 -717 -997 -5428 -587 -2845 -2011 -3550 4228 246 -2543 -3918 -4672 -2477 5455 -1073 -2060 -2052 -6001 -2244
883 -2244 6112 2962 4405 641 6114 2302 -2113 -4924 -2727 29 -8190 -4766 -60 6222 4409 2100 -742
900 -742 8725 -1576 -10705 2909 1295 -2063 -1765 1928 -1999 -1847 -882 -975 640 -589 -9885 -1865 -1476 -2533
918 -2533 633 1050 -1573 9126 3812 -2362 2187 -6597 -9938 10068 2424 -6545 2957 3354 3988 -4527 -4229
935 -4229 527 857 -4417 -3696 4213 -2459 -6782 3507 5153 3083 -6843 -4662 901 3893 -4106 5130 6041
952 6041 -1452 6964 4074 1852 1315 -1487 926 6917 4240 -7132 2090 3095 -7015 -2502 2898 -2437 1297
969 1297 -5555 -3280 5634 -5496 -2531 4867 3381 -160 703 2155 4557 -571 -3009 -3146 4138 -1476 -2813
986 -2813 6603 1593 482 -5573 1618 1651 1352 -6687 4483 8830 -2473 -1787 3103 5656 -6079 -2262 3882
1003 3882 568 2703 -3993 6230 8096 -5817 -6994 11200 2650 -2240 6212 4387 -3724 6428 -3775
1018 -3775 6002 -1550 -12891 3733 8397
1023 8397
##PAGE= T1=  0.2173913E-02
##FIRST=  0.1144165E-03,  0.000000    ,       1298,      -1335
##DATA TABLE= (T2++(I..I)), PROFILE   $$ Imaginary data points
0 -63 -10716 -6183 1945 -3561 1230 -3162 -5753 12621 -2863 -13607 11465 6663 -9085 3041 1667 -8033
16 -8033 3821 -9444 5809 15192 -5954 -15675 14476 -2145 -2603 6577 7109 568 5827 -8622 6326 12130
32 12130 -16620 -12169 14115 -858 -6377 3313 -2705 5397 -2751 -6469 11236 14997 -15789 -2821 9465
47 9465 1925 -2889 3624 6513 294 -4784 -7109 5699 2070 -8536 2213 5233 2626 -4159 4894 3889
63 3889 -2759 854 3086 6666 3106 -14528 -2719 10619 1592 -7460 3140 -1333 -5082 -10816 6278 6065
79 6065 8917 -12542 7166 13376 -8840 -5401 4602 2970 -2587 -5098 -3624 1057 6435 -11047 15604 8033
95 8033 -13906 -7844 6141 3630 -3785 -702 5249 18623 -930 -8392 9273 4332 -14785 12329 2604
110 2604 -7145 -22 -4239 -1233 13821 -9706 -13245 17235 -4926 -14818 7953 -4136 -3142 9652 -8574
125 -8574 1875 14125 -9250 -4496 10169 -6076 -2792 11123 -658 55 5009 1690 3940 4630 -4478 529
141 529 7488 -6619 -5418 4510 706 6885 -3740 1102 2255 -7882 -9345 958 7304 -7363 -913 392
157 392 725 4766 -12918 -9472 11825 -3966 -3267 3755 7295 -7464 -1999 -1498 3326 -2942 -6831 1867 13816
174 13816 -5080 -46 9110 4807 -6687 1564 2459 3046 -6824 -11296 5800 9664 -6253 8127 8802 1917
190 1917 -13098 1905 988 -168 -3337 720 4366 2174 -5146 -285 12200 -6573 -4977 4258 -3315 -4112
206 -4112 4520 -5010 8352 6479 -13051 -4394 11043 -4270 -656 -775 6076 1355 1894 -6596 1269 -1465
222 -1465 -8445 2548 1888 -11209 -5726 5271 -7365 3822 9161 -5250 5696 -108 -9390 2556 3191
237 3191 -4887 -4819 1944 -87 223 -7620 -5761 16305 -4365 -6298 10380 5209 -6788 6406 3254 -8062
253 -8062 3359 1635 3524 3623 -7329 1586 8714 -4919 -6997 2468 -3112 2769 2439 -13057 9702 3609
269 3609 -8026 -747 6071 -3655 -4872 8339 434 323 4517 -720 849 -2907 -526 3496 5699 -3349 5894
286 5894 -1986 -4903 4624 -2558 -8004 6372 -2756 -4154 847 -6829 -915 2835 4237 2738 -509 -2824 -5046
303 -5046 10507 -1135 -1237 -1479 3088 -10960 2455 -791 1255 5981 457 1870 -2339 5532 420 2667
319 2667 4543 -2473 11574 -371 4939 1839 4663 -7640 -1528 2647 -8112 1837 -5086 -210 5587 -5345
335 -5345 4187 231 1893 2907 10037 -5149 -5889 4913 830 3941 8568 -1640 3404 1573 1653 78 5866
352 5866 -3868 -3732 2319 -2698 -4369 -24 -486 -1020 -1670 -4219 -4776 -3788 -3271 -2655 331 3124 80 2984 1652
371 1652 2145 2802 -1968 -2635 -5568 -4925 2300 4461 2543 -1938 5453 7739 -419 -3251 -766 4103 5590 139
389 139 2505 667 1631 1085 2216 -3005 665 1313 1268 1706 -1108 -1718 -2533 -4826 1923 10053 -4350 -4026 -2001
408 -2001 -1269 785 4432 -2376 613 3402 4004 1893 1825 -1390 209 -2772 2808 1090 5785 2657 -7191 5278
426 5278 1067 -6084 2877 3346 2394 -455 -1520 -3206 768 3762 898 -2046 2884 -65 -1694 -3735 392
443 392 4845 991 2906 -112 -3666 2929 -6701 3265 -593 5244 -3769 -6419 10743 5654 853 2622 -88
460 -88 1968 -2757 3946 5659 5259 2847 2312 -616 3181 -11427 -490 -455 577 902 5108 5419 5201 -1289 1528
479 1528 1208 3360 -1291 -2101 -290 -149 5573 2501 -6027 -432 -662 -908 1805 -22 992 6936 6813 702
497 702 825 117 5057 -1141 -6954 7462 -60 -4100 -3739 8978 0 815 -568 3122 -2819 -2611 -3397 3057
515 3057 3650 -2848 4358 3940 -8748 5750 1447 -2941 6274 -4429 -11192 1712 -1234 -1399 7963 -505 -9895
532 -9895 -2496 -665 2192 -4264 -1648 -2051 5691 -3221 2195 4989 3151 259 1790 -3990 6003 -7620 -1830
549 -1830 4053 6608 -8281 -3222 6197 -4817 -5808 -1947 -1317 -892 -4697 -592 3850 3624 -4567 -1116 582
566 582 4554 -2417 -1318 -8635 5850 -4168 -506 2177 1113 -15621 -1564 -4254 -1010 -2220 -128 2577
582 2577 -2591 -1360 1438 6388 -1998 -6447 -941 3652 -1201 -231 -697 -271 -1768 -1141 2012 4818 -7228 -3452
600 -3452 5858 581 -6908 -4038 3637 -2339 -5822 -4224 2953 2818 -868 -343 1818 1865 3935 -5043 -5255 -5273 2252
619 2252 -8695 1828 13 2210 -1072 9836 -72 -3410 1685 -643 -1330 706 -12295 -3353 11195 -5153
635 -5153 3540 3155 2000 516 3429 -6026 -1200 2651 -12410 5634 3317 -11386 5864 -2319 -7432 -1313
651 -1313 3169 3404 1846 -3332 7062 8301 -465 -7967 2801 -6129 -9672 -818 -4903 2164 3785 -143 10202
668 10202 5070 -4239 -1346 4967 3911 -3335 5222 4312 765 -1804 -812 6886 10496 2335 5575 -4445 -3843
685 -3843 182 -2032 5268 4532 195 -5393 2733 -31 -297 1784 1332 -5069 -755 7672 -3 4272 -272 -50
703 -50 -2185 -6257 -3979 2448 -499 -1388 2624 2258 147 3967 -1274 -4117 4523 -3606 -5490 7441 2759 -1125
721 -1125 -1358 1435 1685 3915 4904 -2058 1399 -3228 -1617 4117 -4264 -1898 3742 -670 4052 191 3768 -6216
739 -6216 5099 -726 -4503 -4092 1325 -1240 -2088 2305 -706 -2783 -7032 -1871 9141 763 3652 3128 3254
756 3254 -3755 -2633 3792 5833 -6727 -1825 1736 -830 3822 9634 3279 -355 3533 -6759 894 4081
772 4081 -4504 -1267 -3400 -843 -6952 2397 -1646 -4076 -57 -2640 3529 2677 5032 -4805 1234 -5276 974
789 974 4670 -3205 6726 2221 -6587 398 3030 -1701 -5778 4562 -3005 -936 -707 2747 -216 -981 -6274
806 -6274 -5994 -8047 3617 6383 -596 -945 -3710 2498 -470 -477 -1978 -2295 2854 -1830 -2881 7387 -402 -5834
824 -5834 3820 -8066 -1407 8500 5460 3620 2574 2508 5902 4624 -4829 1561 6536 -2265 -3140 -2054 -1196 -4703
842 -4703 6426 5508 2735 2038 -4360 -7546 3636 1308 -403 328 4667 3973 -1181 -674 -2116 -3340 -1997 612
860 612 1559 6683 6890 300 973 1769 -4489 5291 341 1597 -4145 -4247 7102 -11186 4385 -596 -2306 3063
878 3063 -460 -8567 2873 6052 1478 1822 -5374 -437 2532 251 5889 -4162 -1332 9219 -4837 -592
894 -592 7747 3388 -5280 2765 254 2202 -485 170 -3172 8461 2419 2412 8178 -890 -3177 -3856 2383 -856
912 -856 765 -8984 -71 1918 -16270 -757 2273 -600 3892 1269 5419 9135 -446 -2348 3475 -4691 -10453
929 -10453 5092 5619 -386 1963 312 -3453 5767 1376 -10412 1560 6586 -5432 5535 7324 -5955
944 -5955 2908 1445 2008 296 -2548 -3625 2218 -9449 -3633 9079 -2862 -5626 6508 -1132 9811 -1401
960 -1401 -13116 -2856 4519 -9917 -8312 -1706 5554 -1866 1829 3679 14683 -2637 -10921 7598 3012
975 3012 -3461 -6552 2146 873 -5210 -4131 -4815 4433 2271 2563 11385 2921 -5356 -198 6363 -6376 -449
992 -449 2770 -6927 5887 -9938 -4047 9682 2085 -8096 3181 4543 1862 -5826 -239 -141 5133 -1168
1008 -1168 -1370 5562 -2881 -4294 5228 3463 -7215 1021 -1563 4402 10819 -9225 -7054 4915 -292
1023b92
##PAGE= T1=  0.2288330E-02
##FIRST=  0.1144165E-03,  0.000000    ,       7857,       2839
##DATA TABLE= (T2++(R..R)), PROFILE   $$ Real data points
0 333 7019 -4676 -3577 7478 6079 -1370 -6961 6408 13880 -6186 -11366 8990 5195 -10701 877 870 2700
17 2700 -275 -8648 5380 9855 -4819 -5270 5682 1046 -5447 -4475 4554 5544 -11111 -6059 17255 -3407
33 -3407 -15703 -1591 2502 -3730 1472 5051 6223 12170 -5879 -1810 14291 -3925 -49 1426 1732 -3668
49 -3668 -3710 -3444 7015 -2579 -15091 1993 6802 -8647 -7759 313 5197 -1299 -2799 2491 5301 4466 -6931
66 -6931 3503 1872 -10002 -5805 9330 6536 1281 -4323 5788 6433 -5725 -2294 -2783 5512 3291 -3218
82 -3218 -1599 9199 -4624 -12016 10725 -1973 -9576 -1055 -5486 3297 1555 -2621 8305 2470 -9403 692
98 692 3934 -1510 5883 -621 2157 8676 -5134 -5968 11602 3639 -10030 -5316 5150 9374 -10427 -3945
114 -3945 3881 9896 -4859 -3693 11052 2567 -4058 -6512 3323 7384 -3420 -4871 10251 5587 -5180 5718
130 5718 4533 -1108 -3450 -2632 4835 5405 -3699 -7093 10667 284 -8807 3888 1765 -2550 -8392 192 1969
147 1969 -437 -8082 6057 7692 -333 -11016 6831 -2515 -10609 3337 805 8167 2091 -4261 8137 3144
163 3144 -1588 1423 6465 -1886 -7090 -8293 6978 7485 532 801 5153 4353 110 -4949 5668 9434 -5919
180 -5919 -4209 4976 2541 -5549 -3131 13209 1593 -10152 -2993 1233 5255 -5015 -479 228 556 -558
196 -558 -6066 3812 2952 -2537 -5705 4816 3964 -6335 -2834 4219 892 -5685 4694 8986 3869 -7804 -7261
213 -7261 10173 -2584 -7440 1287 826 5898 -10502 -7283 10395 2169 -9399 1770 2052 -6844 -2422 2211
229 2211 -2220 -680 -3289 -4135 12865 1772 -4737 3064 7449 841 -5383 -9026 -5 -1725 -4618 1258 8994
246 8994 -6565 -3506 221 1312 -2207 -1101 323 4849 4855 -2336 6976 15318 737 -6715 8531 -1786 1083
263 1083 -3681 -725 9803 -3449 -7366 7801 -742 -9376 -3318 -3413 253 -264 -6305 3298 5269 -4995 -8013
280 -8013 10255 5865 -8822 3761 -2779 -1935 -1527 -1705 6338 849 -5670 4319 10688 -1243 -3561 3931 -1194
297 -1194 -6142 -2270 -1052 4839 -989 -4690 1013 3691 -2893 -2952 5500 8859 2720 -11302 5781 7297 -11171
314 -11171 255 -291 1958 2431 79 -5465 1968 -2127 -3427 5625 -886 -444 1254 3185 -2170 4032 -3448
331 -3448 5204 4763 -4877 2153 832 811 -809 -5471 8494 3889 1455 -7085 -3845 -3921 -1549 6091 2703 4651
349 4651 -308 569 -4365 -3190 1502 3585 9390 5481 -2436 -2398 3534 -1250 -2371 -3084 4014 3370 -885 116
367 116 -4957 368 659 -2102 -1184 5145 -1942 -3278 -2008 -901 -176 -61 509 636 -1840 1976 -1064 -1496 5545
386 5545 -4577 -1348 -2951 2523 3601 -4911 -742 127 4054 2177 -1109 -1081 4819 4130 3681 4447 3934 -1198
404 -1198 2120 5018 -7998 3682 4932 2095 -3275 194 1651 4273 248 2758 1302 4047 3981 827 -44
421 -44 1682 -6405 1027 1293 3839 -1828 2885 2091 3808 -5577 4284 -692 -686 -8428 -4998 -2223 -3540 -2378 -2039
440 -2039 -1107 -2181 18 -4513 4523 -1862 -4897 -3015 4814 -5248 -3672 1070 2997 1057 1561 833 -3749
457 -3749 -555 2313 -3781 -4651 -514 1181 1196 186 1958 1788 4544 85 -1289 -8465 2480 1046 -2560 -4532
475 -4532 -3393 -324 865 903 -578 -3718 -2425 28 -820 -141 -5920 -1644 -4757 4570 1407 -2210 -599 4457
493 4457 -2496 -1711 2709 4993 -2046 -4461 -1328 -3642 -1318 831 4864 -4260 -3847 -8005 2101 6239 1943
510 1943 -5929 6085 6427 -1888 486 4857 -3908 -2882 -4348 -5749 -1184 -4626 4640 -2067 -4211 -5240 -1537
527 -1537 -1288 -5524 -4627 5722 4916 3942 1123 -1198 -843 -1669 -4314 7575 2053 -2757 -3766 859 -1751 -5126
545 -5126 -867 1265 -1100 618 -939 5468 1536 4115 67 1725 -1055 -2260 -685 1438 -2913 -7437 -4166
562 -4166 1734 238 -6791 -1145 -2669 3272 231 -6021 4442 1136 -3339 3866 8284 -2126 -4819 -3803
578 -3803 -214 3249 -427 -4426 6777 1467 -1214 2778 9168 -235 -3884 2106 2277 873 -5623 1582 3509
595 3509 5491 207 5364 3391 -651 -4780 1207 7588 2645 -1741 5649 3368 1645 -7220 3034 -1599 -5302
612 -5302 -7368 893 8101 -4647 3307 1631 5917 -1876 1226 7398 1623 -1846 -3136 2191 -2277 496 3113
629 3113 363 -2937 -776 -3187 4076 -3302 236 -6623 6556 2403 -7488 -5183 2411 -652 -4485 -3514 5484
646 5484 5356 -570 -1235 2103 -3175 -2287 3389 6552 4518 -9879 -3550 2794 2372 -2011 971 -4396 7586
663 7586 -2236 -5300 1304 -556 2720 648 -1451 -2986 -5193 -1144 4999 1542 -680 1300 1800 -3794 -1758
680 -1758 1776 896 -5278 1118 3998 2716 -1141 -3427 1841 8074 -2339 -6060 5597 3992 -1921 -1461 120
697 120 79 720 1363 3499 3068 1460 485 -3805 -2861 201 -2188 -5166 -3990 1073 -3822 1015 -5956 -4684 -841
716 -841 1960 518 688 -3246 6596 -2005 -531 -120 821 3770 4462 4531 7770 1246 -2055 -1913 8297 -6641
734 -6641 3418 1028 -4239 481 2923 3788 -2916 2523 1688 2802 320 -2071 -4890 729 6520 5783 -958
751 -958 -3482 -4583 -4657 -244 -7541 -2896 -982 3083 -2312 1933 -50 3949 -2881 -528 -3250 2669 -1126 3238
769 3238 -924 5746 104 4583 -5213 -472 4032 594 6013 2758 3027 -2 1062 1953 2706 -2517 170 -4020
787 -4020 -2461 3442 -1632 145 -128 921 -5105 -1382 876 1492 792 3464 -3475 1580 -2662 -2596 -2486 3141
805 3141 -2273 -512 2738 -1106 1707 -203 -2385 -3957 -4294 -2244 3848 1990 3078 -3852 884 -8449 906
822 906 8631 -1201 -3498 -85 -6887 -210 743 2777 2453 -2060 -2566 1954 -2391 -4052 3111 4991 -466 -9886
840 -9886 2927 -3696 -7242 -670 -5650 5439 -1449 1435 -2604 -1596 4938 -3018 362 -257 -630 -494 3555
857 3555 -604 3831 -9274 -1280 3517 2095 -5241 -2395 -638 -1953 -5930 -3767 1054 571 2500 2443 2626 -639
875 -639 -1403 -5143 -2286 -1709 3674 -4857 1292 -2484 -2577 -520 4116 2518 -167 944 -1861 2789 640 -2485
893 -2485 58 -5903 5899 6184 3436 -6752 1563 -956 1475 -4284 2113 802 1746 -281 -7004 2104 1215
910 1215 -2572 -1501 7164 -1780 -5813 -1298 3518 -2378 5730 9639 -3078 -5244 -6238 -2325 -3664 -2273 -8909
927 -8909 2318 886 -2989 1289 345 4884 1764 -3151 5566 1495 -1340 3005 3623 -537 -1270 -6426 3307
944 3307 -666 2833 1132 8242 -133 -6671 -45 9881 2073 -4532 900 1061 718 -441 -3374 9530 -5184
961 -5184 -7152 348 4508 1353 -559 3226 8737 -3139 -8612 -186 3367 -2700 -3143 802 5254 -985 -5294
978 -5294 631 1720 -1048 -8248 2038 3109 -3820 -10887 3331 5913 -4516 -6985 12223 3663 -2185 -4193
994 -4193 5697 2880 -10149 -4790 6745 4083 -3522 -4972 8211 1941 -1870 3236 3683 5828 -8093 -2354
1010 -2354 11431 2540 -10412 -5897 7379 7650 -5846 -1413 13896 5613 -9239 -2824 18190
1023 18190
##PAGE= T1=  0.2288330E-02
##FIRST=  0.1144165E-03,  0.000000    ,       7857,       2839
##DATA TABLE= (T2++(I..I)), PROFILE   $$ Imaginary data points
0 134 -7724 -7522 5114 1131 1012 -1976 -872 11005 -5695 -13581 11705 9452 -14525 6959 4411 -2091 -5577
17 -5577 -4560 4103 15456 -7907 -13481 16852 -5548 -14150 6493 8986 1056 -5701 -12332 11544 5186 -17129
33 -17129 -2715 11102 -4941 -9461 -530 3336 8045 -10327 -1218 17658 1056 -14175 3543 4113 2855
48 2855 -6485 -4695 11307 4215 -11754 -6133 17425 -3360 -12070 6074 -2767 -2429 582 3831 572 -13010
64 -13010 -5036 2182 3578 -3528 -13314 -6395 11691 -2678 -8574 1340 2054 -8680 -10122 10284 2847 4377
80 4377 -9762 185 7613 -754 -8920 11677 4673 -13743 -2636 3225 -3558 -209 -7834 -2112 7930 -11463
96 -11463 -3470 8997 8438 2266 -6210 6577 11649 -720 -6144 7983 8280 -13321 644 5767 471 -5693
112 -5693 -106 2729 1565 -8959 -140 5387 -735 -7327 5031 -3190 2111 -4985 -5177 1724 4064 -10810
128 -10810 309 8124 -2828 -8103 7079 1365 10856 -4996 -3829 2521 3574 -12574 6729 8052 -6731
143 -6731 -12296 6661 -4869 2422 -6801 3893 17322 2156 -12191 3162 7953 -2410 -5734 589 -183
158 -183 -461 -7989 3213 2750 -3865 -8073 2795 3982 -10583 -3914 -3237 13617 -6318 -6585 903 3141 586
175 586 -8889 3149 3562 6452 935 912 13843 -6739 -8316 10547 3389 -3748 -7401 4826 4633 -1446 -9124
192 -9124 5976 1115 -3400 -3417 -346 5981 -11883 -4355 2123 8730 -6903 7051 4759 5876 -3315 -7427
208 -7427 1570 7019 -8042 -1297 5529 2548 316 4972 7022 -6242 -6650 -3826 6391 3850 -7656 -4681
224 -4681 8465 794 -4725 5751 1289 1281 1815 -3527 3720 -2469 -11061 1229 3796 -5943 -5492 -126 -2155
241 -2155 -2616 -17083 2271 6145 -4949 -6244 11183 3611 -5178 -4682 1888 1270 3999 -5372 5376 866
257 866 -3156 -3270 9777 5833 1080 2933 -1963 9369 1847 -7296 7606 12513 -18131 -1265 7949 -6204
273 -6204 -9188 6783 2586 -857 -6015 -1101 5745 947 -7854 3380 400 1247 -2548 -5983 -978 7236 -5821
290 -5821 1000 9056 256 -8160 5253 566 -2393 6519 3295 4823 533 -3670 6988 3390 -4163 -5853
306 -5853 5060 -2714 2004 3153 -7172 4291 5350 -7669 1818 1197 3 -7215 5022 -4000 983 1251
322 1251 3271 4189 -1647 978 4400 -143 -5661 -1155 -3008 13542 2726 -5493 5417 -3299 -6909 -4857
338 -4857 7606 5105 -5504 -988 8090 3523 -1151 2419 145 2559 1990 1006 4972 4779 -2732 -816 2180
355 2180 1085 -4233 4855 744 3809 -4618 -2788 -5214 2386 -1175 -499 -3007 3074 -2771 -1319 2069 3023
372 3023 -169 173 -1191 -3507 -2869 5628 2823 2168 3728 980 -852 -479 -128 43 633 -6093 -991 3356 -2297
391 -2297 -4272 -7349 3320 3597 3158 187 -6853 1205 3296 2327 2932 2298 -3567 -5851 5383 2066 -5762 4974
409 4974 5413 5340 -4039 1557 -61 267 -184 1894 -3029 4098 1408 -3146 -4720 -318 -2555 2080 812 2742
427 2742 50 4586 -4514 -3314 -22 -1405 -2721 -587 5103 -3551 657 -2 -885 -11185 -12323 -2681 4018
444 4018 5572 4705 -3709 2574 3343 -5367 1020 -1572 -1894 -6236 -3284 -51 6567 2826 1914 -2988 7683 -4976
462 -4976 7101 648 -8944 -1951 4457 -457 1915 2727 4038 1186 -4513 -766 4952 1794 897 1143 -3858
479 -3858 -2568 1625 -6201 6031 3492 414 -2256 928 -2430 -823 6320 -2227 5355 8719 4324 3367 -379
496 -379 -4839 -3872 -55 1709 -975 4578 1616 -1571 -1612 3869 10021 -2418 -5630 1259 907 1447 852 1277 14126
515 14126 4625 -4740 -2456 102 2634 862 -1860 -28 1550 -2249 -2271 -3087 -2936 -4300 7619 1652 -5370
532 -5370 -5775 -3471 6318 -738 -1428 5577 -1701 4870 3726 2111 3261 -1492 -358 1763 -1285 78 -2599
549 -2599 -2340 4724 -5160 -11224 -2620 5202 -1215 -1436 -607 1262 -6083 -4083 1017 344 919 6568 6199 4091
567 4091 -3832 -201 -1478 7636 -9348 -209 -3505 4883 -9095 1297 -5693 4146 -3677 -2491 3982 -4664
583 -4664 -8403 -6091 8806 827 -3358 5094 1977 -4229 -7184 -736 457 -3797 -3898 -1330 6510 -2468 -3774
600 -3774 -2304 5166 -2104 -8339 1819 4588 -2385 -5995 6908 2815 -4916 -5943 10593 -2626 -10012 -1120
616 -1120 9089 4139 2468 -7818 -5432 6236 1949 -5342 10173 5520 -3925 -4364 10622 989 -10949 1340
632 1340 8 -316 -3972 -1549 -2183 1724 -1620 376 2205 3713 -7115 -5011 2825 5613 2730 5873 2457
649 2457 -4273 -7881 -832 9582 5877 -2885 -4783 5917 1725 -8109 -440 10049 -4676 3890 2316 -1906
665 -1906 3596 -5859 -2604 2960 -4661 -1475 3349 5820 -4894 -6468 -2062 2686 3128 -4443 1255 7110 -4146
682 -4146 -492 4414 3547 -3413 -4989 251 8045 1105 -2958 3614 601 -3078 6396 11008 3526 882 -956
699 -956 8033 7780 -3537 222 -27 3276 -111 -4658 -4076 5950 1441 -6285 2273 5383 2307 356 1675
716 1675 1118 -3167 2403 282 3028 -11628 -3832 7891 -6969 6302 -1930 5399 -7070 -988 1384 -7121
732 -7121 5982 -3387 269 -1419 -6822 -781 7070 -3544 -5381 1170 5187 -2308 -5533 314 3335 -152
748 -152 156 -1334 -5069 566 -2629 -826 -529 -5851 -1031 476 -4852 -1790 784 -3362 5180 374 -1916 -456
766 -456 -2265 4989 9386 -8835 -3633 1168 -6032 -1337 -5014 2172 -2203 2883 1117 -1488 5544 1555 -6014
783 -6014 -2348 1878 -2236 -4319 -11068 6154 -1036 10004 -1434 9588 -7420 3783 8465 2427 -1916
798 -1916 -5677 1715 5136 344 134 948 1527 282 49 -2364 -5171 11262 2958 -2640 2816 -3164 -4699 1027
816 1027 7641 481 -2582 -813 2639 5821 1002 -4518 -3376 -3551 1905 814 -2142 -3819 -2106 7417 2739
833 2739 2020 -2663 -5400 -6213 2098 531 -4619 1378 793 -314 -2515 5435 2638 -518 5470 -2479 -4808 2161
851 2161 2001 -851 -875 -882 5045 5713 -677 520 2725 255 -5406 5079 5968 6634 -6170 -5118 -3826 -1152 -7296
870 -7296 -2051 3647 569 -3689 -2539 4895 10990 4826 7188 1015 2230 -4154 -6514 1245 -378 2553 -1419
887 -1419 7374 -2521 -9552 2294 1115 6741 -6689 364 5944 -9061 -3299 -1531 8414 -3473 -1302 2939
903 2939 3626 -5091 -4060 -2844 6572 2497 2040 2565 5358 2158 -5210 7879 17601 2590 2047 470 9356
920 9356 -1074 4931 2127 10892 -3954 -12727 5563 717 -1286 -3025 4242 2857 -811 -12048 -3586 1830
936 1830 -7497 -2214 8814 7815 -3116 5171 2841 6859 -4067 -2812 8059 1783 -5715 5209 5712 2751
952 2751 -5635 4618 2168 -4955 -3818 -411 1443 -1223 -3317 -3367 -85 -1979 -3847 2035 -6059 -1637 -1274
969 -1274 6848 7020 -950 -8167 210 2652 -7648 -7384 3506 4405 -3430 -6452 2369 5774 -4483 -7479 5891
986 5891 12955 -4046 -8252 3239 2489 -8457 -3704 1514 -1915 -8985 1578 5963 1463 -8246 -4080 7530
1002 7530 -847 -5236 495 5689 526 -10847 -1149 7194 1318 -14379 -181 6873 -2836 -5456 -293 3130
1018 3130 -1704 -8874 -227 12121 -1387
1023 -1387
##PAGE= T1=  0.2402746E-02
##FIRST=  0.1144165E-03,  0.000000    ,       2595,      10742
##DATA TABLE= (T2++(R..R)), PROFILE   $$ Real data points
0 110 9844 1449 -9600 8821 14813 -14585 -9006 10441 34 -7258 -2503 -2019 1133 1767 -18201 12749
16 12749 15676 -16898 -6238 9681 -2915 -1774 -2888 -8361 11541 -4242 -15420 12252 1545 -14929
30 -14929 -880 11266 -2311 -3212 -9266 4185 8463 -7445 -10925 13264 -958 -11513 6362 14914 4370
45 4370 -4413 -3564 5681 4047 -12866 -9183 9160 -3192 -11332 3648 1025 -1828 -7487 -1294 8099 1857
61 1857 -13235 2733 13781 450 -9535 4049 9942 -2576 -7115 -4007 4617 6740 -10051 237 13613
76 13613 -9299 -7623 7314 5379 -4257 305 4519 3072 -1133 -12719 4223 7931 -8710 -1831 2853 -649
92 -649 53 -4409 757 7303 -3346 -19775 7390 8136 -16577 -3973 16363 -8316 -1611 87 563 10426
108 10426 -3070 -12131 16003 5340 -16872 6244 10651 -1044 -1744 317 2086 6327 -4695 -5142 9717
123 9717 -3707 -10625 10255 6499 -9847 -1551 2467 6586 3843 -16895 437 16703 -6760 -9347 6635
138 6635 1619 -3915 -5237 -6532 8086 3297 -15908 -229 15131 -8530 -571 8145 -2403 1292 -4366
153 -4366 -1244 7878 -408 -7015 5043 15907 -4734 -1880 3245 -2525 -1066 -2071 4939 11296 -10225 -3714
169 -3714 2364 -937 -10799 -3142 4962 -5390 -1964 -9425 -2844 6716 -10729 -9262 7475 -4713 -6786 7461
185 7461 3831 4058 -3044 -6566 -1418 10623 -13561 -3416 10767 2400 -8538 3019 8114 -3500 523
200 523 -4833 6009 -948 -3603 -3486 10472 -488 -4778 6970 -266 -3155 -1756 -1572 1515 839 -8408 3767
217 3767 5606 -9296 -4423 -1858 5368 -5635 -878 537 357 -1285 -8010 82 7127 210 -3259 -1139 -1904
234 -1904 1864 -5687 -4889 9396 1587 -6793 6181 7071 -5704 4137 990 691 1123 -7537 -5206 4883 1883
251 1883 -16253 -1058 1184 -2345 -1744 1138 4252 1390 -11097 248 139 -2618 -10091 3321 -2292 -6413
267 -6413 -3413 3691 -7193 784 -3117 387 5400 -7141 -1075 294 -2035 -2321 -3003 993 2055 -1855 -2706
284 -2706 5974 750 -2367 6536 3085 -10174 -3542 1495 -4568 -5188 -2659 -4291 4018 26 -3702 3454 1219
301 1219 -368 3479 -313 901 -3052 -1855 457 13058 114 -543 6246 -565 -5886 588 3556 2322 3664
318 3664 -1474 6884 3107 -6966 -1710 3027 -78 -2413 3555 -1641 603 -2197 -2500 1968 10591 1573 -1770
335 -1770 109 -6064 -2346 746 1820 -4727 -961 -6598 -1888 48 -4709 -2561 7136 -5172 -1470 -2920 2771
352 2771 -279 -7634 1576 6189 -5002 -6176 385 1931 682 -2443 -2137 911 -6700 -6246 -2627 531 -4381
369 -4381 4181 -5265 1026 -6746 356 -493 -5038 -3846 -1013 -469 -1727 3893 1009 6098 248 2013 -549
386 -549 -2449 92 -289 -2090 2329 -226 8531 -2523 -3175 -795 2360 -242 5209 -659 -788 93 -1316 1233
404 1233 78 -1046 -1986 3760 1532 5112 3791 -1925 -1203 -1550 -379 3563 171 -1852 -430 -3116 5818 2281
422 2281 -1994 -9320 713 4338 1640 -5032 -3511 -5859 -170 -2200 -1835 -4576 -4825 -823 2426 55 -6452
439 -6452 3106 -115 -3591 -2790 2007 2042 850 -68 1085 5394 4288 -3172 -3828 4841 5095 4666 3556 900 -5311
458 -5311 840 5256 -2034 1617 -4848 535 2005 -4390 196 -5396 2375 2121 -784 -2762 4166 -2443 633
475 633 1447 4756 -8362 1505 3400 6018 -924 -866 -290 7725 456 1275 3031 3507 -275 906 -1514 -1136 50
494 50 -3596 3898 5724 -9297 -603 8762 -2516 -3042 -3209 1069 -175 -1567 -1332 205 2113 -5826 -3353 3553
512 3553 -1076 -4131 -1619 -2532 843 -4714 70 5027 4483 -7719 2996 265 -5668 1359 -2381 -4650 4962
529 4962 2402 -3599 2066 -2928 3662 6680 3733 -1889 5031 1711 1802 2514 1806 -3080 9754 -957 1784
546 1784 6812 4302 -10458 -6134 6301 -1784 2110 134 5420 5261 -7242 -318 -37 -3507 -367 -6912 -279
563 -279 1014 -3631 -6148 -1444 392 -6599 -802 3908 -2502 -8602 425 -1441 6557 -2496 -1519 2487 -2189
580 -2189 -8890 733 8587 1092 -1731 -6 1329 2393 -3472 515 9963 8375 -2063 -3036 6608 -670 947
597 947 -2379 2584 575 -4429 4182 10068 -1184 -1911 5247 -1339 -3304 -742 6970 -1010 3553 -4272 2098
614 2098 4699 -1201 -1979 8615 -1382 -3051 -2005 -1992 3839 -3162 298 -3140 -3562 -4986 2758 6556 1747 -1172
632 -1172 -2892 -1098 -3731 -1862 1916 4819 -524 -3141 -6076 1686 5076 -942 3408 363 4941 3477 1288
649 1288 1476 6091 -3229 -2247 6117 -9053 -4402 5288 874 4282 -824 -2175 1212 -4312 -6654 -274 1232
666 1232 -4520 -861 4629 -9722 2067 -139 2386 -761 -6941 -3665 -147 3788 257 -3174 979 1842 7560
683 7560 502 4585 1010 -4515 -1263 2835 2341 4011 237 -4702 -336 103 -7269 5128 8607 -6615 -561
700 -561 5482 -4185 5433 1676 -2992 2675 2891 -1116 -5081 -2331 -2409 -1515 3448 2226 -4096 -2913 6345 -3904
718 -3904 -2127 103 9813 -1468 -8910 5684 -1326 -6682 -1089 79 -2667 784 -330 -977 3515 1799 -1841
735 -1841 -2214 1242 3669 -2729 4361 -6385 -772 3478 627 -7 -644 -5462 -129 -3322 2212 -50 -1246
752 -1246 -974 1984 4367 -3057 -5774 -225 -5115 632 899 1760 -2496 -2695 669 -737 1141 -4233 -408 2414
770 2414 2470 -4573 -3152 -896 5384 -2685 -4823 -2218 1411 2001 -2777 -4253 362 -1875 -6175 2030 4367 -7207
788 -7207 1333 -1474 1826 -3233 1198 -1019 -587 204 1374 717 2 966 -1300 1743 2368 1559 1019 5029 1609
807 1609 1246 -733 -492 -2650 2324 1201 -1164 1966 -1078 2593 -2483 -1788 4703 3127 4237 1238 3228 -6796
825 -6796 622 -4754 -7703 -7046 -3440 1711 -232 -3849 -1900 5213 -3652 3342 4881 -6408 -4204 3796 -777
842 -777 -3746 -1292 -1255 4381 451 109 -3092 -1516 -2743 2945 822 244 381 3271 9746 -150 -2286 -401
860 -401 -2771 3481 -5355 4197 -3806 -2273 -6337 2398 -4802 5755 2765 -1633 40 807 995 2332 1194
877 1194 2076 -2623 5517 5595 1817 -3237 -2768 1339 3551 -11371 -1532 -2789 -1210 -5653 581 4843 1785 -3948
895 -3948 -2600 1292 714 -1596 -3696 -2394 -1629 -1835 332 1715 -632 -4023 -2064 1414 -1107 -1731 1413 -4381
913 -4381 934 4252 716 3058 -445 -3220 -1267 3708 -1179 -2555 1263 1124 -2829 -2195 -6185 2472 35
930 35 -494 3116 8514 -3640 1595 7208 4665 -949 -648 623 -1124 193 -2661 5023 3797 -5270 -3570 3229
948 3229 -294 -644 -4136 -3508 3593 -7911 -6369 2919 -739 -7541 -110 1815 5943 2510 240 2730 4004
965 4004 -8054 82 6493 -5288 -2878 2792 2344 -3656 -8332 3919 2466 -1340 -11285 1377 4403 -1540
981 -1540 -3524 6190 -706 -7598 -3112 2621 -2308 -2172 -3622 4201 8922 -5452 -4649 9471 3374 -7968 -2147
998 -2147 -3432 2629 -9497 -9274 -128 6619 -9529 -460 1075 -4207 -4742 5 -4389 -515 -9240 -12098 7251
1015 7251 5187 -7240 1127 4060 -6792 2601 4692 1372
1023 1372
##PAGE= T1=  0.2402746E-02
##FIRST=  0.1144165E-03,  0.000000    ,       2595,      10742
##DATA TABLE= (T2++(I..I)), PROFILE   $$ Imaginary data points
0 507 10654 -13529 -997 12600 -15350 -16338 12926 7036 -16414 -5040 701 2292 5728 -18344 2856
15 2856 19354 -18469 -10576 15669 5298 -15252 -5538 -2934 7517 1772 -19807 14043 17629 -22625 -6255
30 -6255 13291 -4988 -11274 7322 -980 7092 3600 -17004 8501 10631 -17722 6043 20822 -6864 -6971
45 -6971 2956 -1042 7309 -8676 -4003 21425 5977 -18970 1053 7327 -5976 611 220 6995 410 -14893
61 -14893 -5506 23873 1308 -17681 8231 8687 -13236 -5505 9065 -146 1777 -8832 1319 22228 -336
76 -336 -10293 11161 15540 -9598 -5168 -226 9417 -7305 -13606 7950 14283 -11807 -7077 13909 7626 -3224
92 -3224 4873 -3054 9262 -1492 -7205 5755 8649 -18715 -6159 14483 -4204 -2824 4349 1761 8521
107 8521 1600 -24067 13831 11082 -23551 1464 13303 -7562 -7234 6763 82 10216 -12268 -16982 22176
122 22176 11993 -13367 7968 4335 -2001 -6397 2800 6243 1514 -9631 -12766 6801 -6025 -14034 11034
137 11034 1661 -1964 -1820 -3585 4999 8728 -11765 6367 14358 -11081 -14041 8251 -1229 -6291 972 -4676
153 -4676 -3101 7728 -12182 5314 10719 -10994 -4801 16924 -1030 -2147 -2482 -3469 5926 -11424 -4641 2443
169 2443 7559 -7013 -4543 7234 -4341 1264 2269 7468 8077 -8235 -8285 13899 3110 -11404 -2660 1275
185 1275 -2045 -10047 -7769 3423 5120 -3798 -2997 14799 4113 -1063 3042 10982 1546 -7425 -1648 4336
201 4336 267 -4041 -10218 7548 -1058 -7706 626 4582 -2600 2164 -2964 -1830 4216 -7578 3781 8345
217 8345 -5367 -6586 7762 10013 2777 -2927 -4599 6192 3572 -8860 7464 -183 -1979 -3083 10880
232 10880 -4040 -3 3836 -5777 8554 110 -9757 2530 11590 -675 -1613 2023 833 -1041 -844 2184
248 2184 9991 1795 -9002 8391 -353 -4419 -4045 6371 -5094 116 -1857 -4835 10444 -9645 -3267 16332
264 16332 2398 -7917 -3938 4054 -8505 -226 -5620 5038 3613 -3497 1187 10551 -199 -8780 3040
279 3040 5618 -3377 4318 -4118 3793 -465 -1848 3572 -724 -1660 -6613 5332 -3363 -993 -5130 3125 7746
296 7746 3119 -11065 -1032 4447 -6852 2974 7034 5844 -955 -5344 -3014 -2532 9 -7226 5151 5916
312 5916 3733 932 -579 -1907 526 316 1261 6024 -5042 2478 2635 3303 2819 -215 1772 2906 -2753 -3251
330 -3251 -2374 5106 8675 -3578 -598 7455 789 1461 -349 4227 -464 -4669 1820 4480 -7604 -4478 7611
347 7611 6382 -4475 -1556 -3481 -1714 650 -674 4293 4566 -1945 1004 4455 664 7009 6977 -335 3851
364 3851 -5595 4932 3858 -8784 -36 3078 -4489 -3544 9501 -327 -346 -4620 -1269 -1994 -423 -5700 162
381 162 2019 2870 2386 4457 2910 777 -927 865 -2439 -6538 2349 1440 2441 5638 -2038 1036 -564 -1381
399 -1381 367 -2010 1162 2614 1203 2271 -6198 1866 -6094 6006 8779 -3892 -1200 -5160 1647 -8153
415 -8153 4781 -2386 -1384 -1158 1879 -1415 1385 3955 2038 3514 -8693 4544 727 -3016 -3138 2060 -2762
432 -2762 -1160 -4042 566 2619 -3843 -6439 2885 798 465 -133 -1138 -2735 -1664 -3131 -1181 6254 4057
449 4057 3267 -2648 1363 3629 -4277 39 -4381 -5385 -6429 -2662 3956 4841 52 -2919 -3680 -5386 -337 1762
467 1762 562 9125 5695 -709 4741 1752 -4901 2888 5630 -2610 4713 9403 -4081 5576 -5591 -655
483 -655 652 -9992 -1947 6253 5849 -5242 251 2924 -871 4393 3459 10804 2560 -1544 -3096 6717 773
500 773 2135 5138 5490 3618 5580 -2022 -3999 2043 -5860 3776 -880 3008 -4260 2873 3926 6795 -5302
517 -5302 -1906 8071 3588 -3883 -242 7737 -4661 -2377 1754 -2514 541 -6027 -2078 4410 1931 -8450
533 -8450 6523 5993 -6563 -2641 2832 -5696 -1327 5097 4113 4015 1588 3865 3855 -220 84 -1675 7255 -1760
551 -1760 -3039 -1719 -1675 8096 -298 -1080 2125 237 2883 1006 575 -5230 5682 -4682 2230 4548 1443
568 1443 -3691 8048 -2702 -6271 7557 1703 -5595 -6840 -726 613 -274 -3050 2558 6827 -1227 -5097
584 -5097 12304 870 -4092 -8370 595 6048 8688 -3002 -414 9773 -4258 -3751 1552 1153 2811 -1410
600 -1410 -4346 704 3017 -1316 -3176 4795 -4466 -2689 80 2569 4833 1567 -4088 2513 -3601 -3961 -920
617 -920 8230 -9296 -830 -2587 -8463 -1366 -1543 5426 -1505 -439 -9252 6647 1363 -8809 1232 -4907
633 -4907 -284 -3100 3904 1722 142 -8785 890 2081 3871 2627 -7964 3913 789 -9406 -1471 4776
649 4776 7558 -7930 2812 353 -1211 -7156 -1031 1399 5487 -336 -2275 2034 1307 -5055 4639 9465 3674
666 3674 2994 2321 -1512 -1704 -1663 -2770 5522 861 -3651 1433 515 -3761 985 5531 -2385 3053 -1202 -1480 -166
685 -166 4894 -5151 -3123 90 -4896 3301 9212 6763 246 4068 -1981 2941 -3545 -6042 -511 -2 -2573
702 -2573 -3761 -2532 4433 -7443 -2878 908 -5268 -7716 243 1241 -5117 29 -1160 1383 2627 -2624 -4299
719 -4299 4508 4611 -3550 4955 8503 1485 -6052 -1619 4418 884 -1633 -5172 -249 2838 -1500 3336 9711
736 9711 1141 -4901 -2801 -5188 -4405 167 9782 -1141 -508 -2233 4142 1537 -7881 -3826 1156 -4019 -5582
753 -5582 -4937 -1849 6975 -4897 3147 -4175 2443 -6261 3855 5462 2232 -6391 -3880 -254 4426 2802 -764
770 -764 4887 -1800 -3284 -5365 5318 5562 -5807 1061 -5090 -444 -2964 3133 -1540 -4844 6925 1994 -737
787 -737 -132 5419 736 4684 1277 5545 -5147 -1109 -6043 1359 2118 1532 -3841 754 2599 2090 1412 1236
805 1236 -3181 996 3380 -4611 -829 -9270 92 2726 1143 396 4413 1212 -4311 -3914 -2247 -2119 2607 -4873
823 -4873 -3158 -420 779 -5238 -694 -5719 -2015 -2085 6398 3612 -2654 -3964 6317 -592 -5229 -8746 -4321
840 -4321 -791 -1330 5590 2456 -789 6903 -4045 -5369 7441 -6567 -1240 2127 -4929 -108 3924 3168 -6045
857 -6045 4156 -3750 4562 630 -2198 774 6735 949 769 -7692 -5815 3748 3370 -7134 933 1763 -4711
874 -4711 2909 3650 1386 -8314 -1692 4622 -6730 -267 -3687 -935 -401 -893 2403 11149 -2698 -4104 10532
891 10532 1740 -5419 -3102 5918 4272 2403 861 -4417 5638 3885 -2917 -1724 1562 1857 1732 2439 7379
908 7379 824 -10859 5562 2649 -1709 2253 3328 -3102 -3230 -2544 3040 10 -4757 54 -585 324 -2044
925 -2044 1130 5633 2329 -8137 -9049 -13 1509 173 338 4266 -4589 909 711 -5582 -285 -3953 595
942 595 4005 -1342 -5629 -244 4263 5416 920 971 3536 -1568 -3244 -44 -2354 10383 -15773 -294 9299
959 9299 6635 -1646 -1859 -25 1543 -11041 -8451 4151 -6719 -5317 7837 6088 859 -546 -1211 3744
975 3744 -5975 -3210 -5459 14342 1803 -13203 4626 8820 -7391 -492 -6422 1767 4165 -7152 3013
990 3013 9268 -5769 -7210 7857 5085 -12605 -2186 -6191 -1155 -768 -3848 4402 1098 -1534 -9188 11589
1006 11589 -1720 -1385 1452 7055 6162 1239 -508 9082 5361 -12699 60 10556 -9266 -2805 4934 523
1022 523 8889
1023 8889
##PAGE= T1=  0.2517162E-02
##FIRST=  0.1144165E-03,  0.000000    ,      -2100,       8771
##DATA TABLE= (T2++(R..R)), PROFILE   $$ Real data points
0 -89 7163 8824 -9884 585 3290 -10652 4571 5058 -679 -1422 587 -10378 3569 7514 -10488 6644
16 6644 5788 -9813 1631 -2058 -3707 3578 433 -5005 10348 -1156 -1146 6725 -4439 -3743 8083 -622 -3314
33 -3314 2822 -11214 5809 7128 -13912 907 2874 -8598 1879 -1277 -1817 7790 -3640 1790 -1096 4142
49 4142 -8508 1124 1286 -3789 -3545 -4202 431 -2709 -3304 -2873 1247 -1162 -5310 -7071 600 851 -5934 -2544
67 -2544 853 -6008 -1443 -198 -2182 2834 -331 -4929 2568 -427 -2250 2232 4374 -6749 -2626 -1568 -2101
84 -2101 2805 -1705 4680 6527 -5260 -9782 7539 4576 -173 42 -7978 -2521 3635 -5405 1429 4917 -9345
101 -9345 -121 9498 -4292 -1862 9495 -202 4405 -361 -10801 6833 2626 -5189 1690 -4081 -2536 -3404
117 -3404 -1225 2818 9563 -1494 -2152 14298 105 -6783 557 -3713 -5297 9567 -5314 1336 10984 -3350
133 -3350 -123 9668 -1233 2539 5983 -5903 5225 6864 -2909 571 3229 -10853 2020 6749 -3401
148 -3401 488 409 -6644 1601 61 -5205 4166 -414 -4014 11381 1603 -7306 -3362 5423 706 3725 542
165 542 -3099 -2174 583 -8338 -791 4072 -3841 1686 -2281 -2610 -1602 -4785 5123 7918 -3423 -1703 -1619 1644
183 1644 967 -5269 3728 781 -1091 -8194 6870 7199 -2976 979 8758 2992 -3574 -891 773 -2886 1287
200 1287 535 -2878 784 3238 257 1357 1933 -325 3943 2761 -3819 1160 -2103 907 -1134 1165 -1541
217 -1541 -575 -5922 -6046 2984 -647 -2102 3433 -1073 1133 -772 580 1458 11469 -8344 -209 3970 -5936
234 -5936 445 2469 -730 2023 7030 -5549 6743 -1963 -4185 -152 -26 -6831 -1142 -4886 -2424 8860
250 8860 1102 -7500 7516 -386 -5989 5700 930 -3329 3823 -1989 2153 7088 -7887 10998 7802 -3591
266 -3591 3572 6325 -2127 5330 818 -261 3263 5513 -11035 3815 8249 -2010 9307 3849 634 2680
282 2680 988 -7092 8444 -420 -7563 -3893 5790 -10019 2866 1636 4109 2364 -126 -4686 4969 2574
298 2574 -4636 -332 -7284 -2020 1227 2731 1986 393 1449 -1230 8398 -4316 1182 4509 491 816 1149
315 1149 -4244 6324 76 -193 -6435 -3697 -3343 -1088 2629 1351 2673 1430 3204 -1660 534 2127 -404
332 -404 -2744 2460 -773 2715 -4076 -391 -4247 -2307 1979 -4064 2176 1690 -1574 -715 200 -2758 1407 -1990
350 -1990 -2235 -1766 -5339 53 4052 5399 6317 -6835 2228 -3010 -1027 -629 -1539 -1230 -4048 6148 -2723 3309
368 3309 3244 424 -3511 -2290 -5320 3157 -3504 -1678 2650 2724 -980 -2732 6630 -4708 -895 4019 5631 65
386 65 1585 -2700 -2608 1167 1807 -297 -2572 -1321 63 -2756 1301 -955 -5317 7179 2871 -4774 190 -1639
404 -1639 -3190 2570 -5368 3353 6051 -4853 1153 -2573 2235 -1927 3739 -1856 -2050 -295 4336 -1170 -3441
421 -3441 -1876 3324 2259 -5236 465 5533 3051 1895 4127 -840 -2002 -4071 1474 -915 -6413 -3068 -1522
438 -1522 780 -2645 -5669 -276 -505 3143 -1121 3531 -4015 -3773 -1174 2308 -6625 2525 -150 2684 481
455 481 -401 -1222 3995 236 -1489 1356 5435 1854 -2795 5815 232 -3233 -6439 3936 -776 3077 387
472 387 -6165 837 490 1398 1305 -6085 -569 577 2562 1152 1036 -5639 2850 -2424 1944 -2164 2133 5035
490 5035 4657 -1909 -3809 2512 -671 -1115 3931 -1489 -1594 -4199 -3130 -4931 1597 3255 2563 8931 2072 -1557
508 -1557 -1819 -3780 1044 -1615 -2301 -2113 3275 813 -25 956 920 -3983 1949 -876 -5063 2352 4933 3507 -2768
527 -2768 -5913 -3514 2425 -4476 4359 577 -5229 3654 3175 -4028 2043 2482 -3539 -4379 -3046 1368 -3197 191
545 191 2577 157 -3324 133 -3409 -3147 34 -3812 455 -2784 -2074 -4700 -4127 -1275 -9903 -672 5236 -5739
563 -5739 -622 -4650 2965 6259 1441 209 -774 2737 -5441 6727 -1112 7719 4613 -2381 -5416 5675 -6068
580 -6068 -486 1005 -299 -2184 -3863 2746 2544 43 -6540 -4898 -1140 1251 2556 2620 -1625 -902 -3441 -3039
598 -3039 -3034 -3715 7204 5662 -89 -3 497 -1531 -1821 -17 5625 8786 -1754 -1444 1545 -535 1438 -1332 1023
617 1023 -5437 -874 -3803 617 -1210 8055 -3905 1015 4880 3315 -1549 -3752 -1466 2789 -3294 -2839 4187
634 4187 -370 4140 -5865 1547 1797 -4823 -5997 1704 1033 1260 4920 -3567 42 -1164 -6179 3360 3820 636
652 636 699 1193 4364 1547 211 2252 5290 506 -4236 -306 2298 -3654 6023 4468 700 -2666 -72 -7111
670 -7111 2840 -7282 5173 5219 -1429 1065 5097 -2532 -7774 2578 4795 -3588 -2276 3236 -741 4499 -6037
687 -6037 -3117 1901 -5583 2735 -3478 -5852 -2642 -541 -2245 -282 -2826 1295 3597 -3544 -4374 6220 2052
704 2052 685 3214 4145 -3973 -720 1737 5733 1880 4757 947 3108 905 4626 -1262 3214 3647 2707 -327
722 -327 199 1809 3614 7104 -3788 1396 1815 5537 -1032 1618 -1574 1013 -922 -1917 1431 -6696 2380 -4468
740 -4468 3253 -5951 121 128 1706 -88 -451 -2170 3842 286 1404 -1023 651 2122 -5953 -3376 793 -6806
758 -6806 -2075 1299 -850 -4504 1808 1240 778 3104 1651 -1458 -1293 1899 -6715 6032 -3241 4777 1328
775 1328 -3477 -650 6750 -2250 4298 1700 -4927 2462 3312 123 2455 -3082 110 597 -1019 587 2737
792 2737 729 3706 -43 -2513 361 -1729 141 -170 -2651 -2685 -564 2865 -8042 -1383 -1412 -1471 -5554 -3669
810 -3669 3979 -1425 3047 3425 8012 783 3123 1681 -3690 -9244 2173 -2760 -4688 1842 -3737 5484 -2480
827 -2480 3417 5854 -3694 -9868 59 -4616 -280 2107 2468 -1123 1726 4103 616 -227 3951 -1237 1654
844 1654 -868 -4207 3827 -3757 -1116 2205 -2194 -728 242 1541 4351 904 4349 -83 -4685 809 905 -3532
862 -3532 4368 4639 5488 2689 -1910 -3861 1842 555 -7270 2534 -337 1702 -4927 -1913 -2444 7021 -4809
879 -4809 -504 3914 1589 4613 -4276 1897 837 -2634 -3444 6796 -1083 203 -3339 -2306 5455 -1824 537
896 537 3398 -876 -2085 592 2628 -826 -3233 852 -1416 1454 -3254 -5361 2856 -2872 2812 2607 2899 3652
914 3652 -3503 -2575 777 1113 -2658 381 -2794 -3618 1040 -31 1326 1815 -2323 622 -1574 6708 -5066 -4555
932 -4555 5329 -3201 5460 -1239 -1020 955 -1499 -1450 2162 -470 697 8055 44 -4054 3108 3735 -3975 2664
950 2664 -4485 -2051 -1465 1899 254 3955 736 -1721 2825 7002 -2758 -4453 2134 6750 4134 1714 836
967 836 2615 -63 4612 -4785 2762 1757 4978 574 7395 -3622 -3493 -4698 -4861 -1290 -163 -4515 469
984 469 -2907 3286 7161 3592 -5263 -8165 1453 1728 -5366 5020 6482 5073 5959 -2916 -1069 1887 -4938
1001 -4938 205 -1498 321 -1554 2114 4328 -19 -647 -76 3472 -2904 9015 -2178 1642 8439 -5506
1017 -5506 -305 -336 -4063 -3374 2033 577
1023E77
##PAGE= T1=  0.2517162E-02
##FIRST=  0.1144165E-03,  0.000000    ,      -2100,       8771
##DATA TABLE= (T2++(I..I)), PROFILE   $$ Imaginary data points
0 414 19805 -3249 5000 18792 -5192 -6646 11312 -5920 -2725 6235 -3823 1439 6014 -11843 -3068 8916
16 8916 -6099 1748 7919 -2727 -1003 -697 -3604 3563 -10224 -3657 3037 -3540 -2300 4856 7796 -3601
32 -3601 -1164 -4143 111 -4423 -6634 1248 4198 -4306 -11944 1718 1105 -3419 -119 -3051 4115 14124 -6498
49 -6498 3457 4320 6027 -7596 -1184 2226 1654 33 1662 5622 -2729 -5559 -2554 -859 -541 -7479 2442 1569
67 1569 -3985 5933 1975 75 2193 -37 -9188 905 376 -9899 -4605 10497 -410 1910 5508 -4518
83 -4518 2001 -920 -1675 8216 -3570 -7331 5085 10287 -5990 1921 -1953 -7549 1811 -4753 -6332 12292
99 12292 -6544 -2018 7659 823 583 5722 -6265 4785 2669 -13558 -561 7314 -3133 -6969 3051
114 3051 -2377 3817 4223 -7126 3646 1527 -9223 2183 5027 -7078 1826 7368 -6610 8317 -23
129 -23 -6414 3951 -2518 -5945 12750 1972 -13581 9062 -3039 -7780 327 -3665 4337 4844 -3034 -6303
145 -6303 13077 -5981 -3887 5802 -3036 -4920 -130 -7812 2963 11141 -6329 2774 7356 2295 -355 2359
161 2359 -995 5142 9326 -7589 -3219 -7727 -4109 6900 -3055 -3428 -776 2397 -1813 2715 -2836 -1879 5862
178 5862 -3209 -8508 -1109 -553 -5996 1041 1248 2034 730 -2232 2616 -2043 -8536 -2623 3943 4640 -1719 -9079
196 -9079 6196 3034 -113 1482 4512 -4425 -2757 -2244 -1525 1691 -10120 5173 5614 -4813 909 1427 -7758
213 -7758 7274 -742 -2784 4426 -1850 -7129 9819 -2957 -1630 -2169 7152 859 -3374 -2131 -5260 5404
229 5404 -3911 -6398 3024 10758 -1433 3757 -837 1181 -480 -8410 -9529 3710 117 -6167 -3774 3412
245 3412 -5732 3583 -11802 1174 -1549 -7309 4861 1863 -13006 11250 6868 -7951 9246 -3633 -2326
260 -2326 6826 2305 -6917 13964 4508 -5032 -1405 -1223 -2751 -3366 3079 -5095 -3653 -12491 -20 6535 -2044
277 -2044 -1930 2918 4127 4833 8821 3830 10858 9819 -9025 -1146 1531 1776 -2863 2053 -2903 2566 3374 -4995
295 -4995 -1397 -3183 -5392 5180 -7756 -2996 1970 7949 6413 3129 -3003 1346 13520 -135 -1261 557
311 557 -1424 -1480 417 -8045 -3060 1787 -1846 -85 6174 -370 -6348 7520 9174 -7764 1735 6205 2698
328 2698 -8365 -1514 -1226 -5167 365 -1864 -5374 3058 -2112 -2446 4019 -3972 -9011 4614 5200 3071 3434
345 3434 -5908 6690 -1534 1056 5289 -1702 362 -894 -1811 2090 -5540 -1701 -186 1293 952 -498 -590 -3698
363 -3698 -270 1822 -126 -6041 -1123 553 525 -347 -4298 -3688 5118 327 -2304 4189 -5501 -4204 5379 -4294
381 -4294 2124 2914 -9247 -212 -3644 -1818 -6754 -434 2551 682 5484 6309 3504 4481 -1753 -2322 -7086 -2654
399 -2654 -5119 -417 7682 -164 -2843 -3894 -10287 -6274 1535 -279 3588 5850 2220 -2026 -1216 762 751 3322
417 3322 5065 -6823 -4316 -2804 768 97 -3004 -4579 -1194 2675 1295 -2926 -3410 -2727 6235 659 6977
434 6977 -6623 -3834 -4884 -1599 -3466 -2474 4035 1135 6604 -4326 1941 7780 -1597 493 -1200 -13954
450 -13954 -649 1557 -1335 -2809 -1309 -964 -5689 3451 -4242 -2700 -9345 -2108 -2348 3482 8702 5832 2923
467 2923 6095 -3431 -4559 1977 10110 -4832 -185 738 1656 -143 -5507 -4793 3116 -621 6077 -2001 2057
484 2057 -1020 -2951 -598 8770 6193 -1350 -423 990 -1598 1553 -2975 1198 -289 -1270 3040 -6985 -6452
501 -6452 -3160 920 -273 1668 11 -4439 2988 455 -2921 -5386 -3911 -5167 -1620 -1804 -978 -2557 -5543
518 -5543 -182 -1403 1198 752 3237 -5451 2481 3972 -2277 5946 -2832 -3516 5018 12414 -7181 6760 1288
535 1288 -717 1391 -5040 2025 -1151 -1118 -9275 4412 -3854 6319 10706 2228 -988 4502 1655 7625 -2557
552 -2557 1349 335 8189 -11 -307 -1629 817 -2817 -9202 1554 3096 2157 537 5322 1048 3051 -2909
569 -2909 -728 4194 -810 -4512 -2150 3346 -2017 -837 8728 2530 -4631 6574 6274 5044 -4667 -4194 2888
586 2888 4520 887 -3738 2936 -4799 -3068 -2329 2704 -2648 -1929 4755 1416 -2015 4923 -2532 3775 -1852
603 -1852 -6160 -6034 -1110 2188 -5426 -3074 -2186 3286 -360 1673 3607 -3375 -1054 6621 -2490 3917 -6701
620 -6701 -2622 -5373 -273 1208 -53 1250 833 182 -5407 11312 -5500 -1926 -7093 -3089 6959 6167 1397
637 1397 739 1827 -688 -977 2383 -900 251 -271 -1937 -238 -6505 -2769 5135 -5068 5557 2481 -12922
654 -12922 -3912 7698 1047 4209 -1512 -3262 -1085 2539 -4290 -767 713 859 480 5429 -372 1973 -896
671 -896 133 1229 -135 -2180 -349 2747 -3164 -3120 3982 -4434 2259 -6812 2157 4551 1708 -3331 7999
688 7999 -4991 5084 334 -622 -867 2806 -1956 -4768 2482 -2823 -1561 4487 -3832 -8948 2856 -8190
704 -8190 3319 -2079 -1044 -4506 -7262 -719 -1460 -161 5445 -3929 1810 -1294 3738 3910 -8538 4917 -9366
721 -9366 -270 -2025 2099 706 -7489 1873 -9593 -343 -4894 -5939 2294 -1177 -4305 2100 -1487 -2752 6058
738 6058 -1431 1830 7933 -7774 -3463 -1772 -6751 4200 7698 2151 2794 1703 -3788 1930 -3391 10202
754 10202 1437 4623 6874 -6792 2059 3269 -3854 -8210 -6370 -537 -4784 -3552 -3574 5465 922 -4819 -1212
771 -1212 -2817 3464 3564 9734 -1512 4835 -5064 3818 2895 -3343 -4847 -2153 -671 2812 -2285 -463 -3466
788 -3466 1543 -1330 -95 -1702 2959 -425 -342 2973 4930 -3841 -1644 -5957 1476 2858 3762 329 -1291 97
806 97 3695 2989 1007 3195 2103 5633 -1821 703 -3746 -3411 -2072 -6589 -3852 -2806 -1601 839 -690 3590
824 3590 888 -3169 -5279 3322 -4513 -2162 327 1131 -1845 3822 -5468 -107 7209 -10244 -2259 -3000 -5533
841 -5533 -3857 -3412 -472 2149 3841 468 -436 -8933 -3397 -186 355 5677 5687 2778 3211 946 110 -2307 996
860 996 3367 -2847 -4786 398 -513 3419 4005 6667 9032 -3341 -1776 -5938 -742 6214 3497 -3676 1008
877 1008 -5070 -343 3853 2823 8214 7048 3268 4916 657 -2991 6227 -5058 -7786 2023 2698 -344 -5874
894 -5874 1040 5876 697 -284 3915 2055 -563 -3103 164 1387 -2352 -3544 -5410 5293 -503 5074 2059
911 2059 7901 2635 228 -3247 2032 6062 596 -10207 4364 -2850 -3599 96 -279 -7768 675 -898 -6390
928 -6390 1054 1080 12958 5309 -5660 -1346 9031 -1293 -2145 -1889 1263 1560 715 -6242 4456 11571 2675
945 2675 3430 5967 -10864 -4021 2941 -3068 1233 -3694 -5592 1759 3812 503 -3567 -2444 3573 -2440 -793
962 -793 -4440 -1484 698 3079 -3067 -2465 1985 4743 7999 -954 -1131 6185 982 1984 -7295 -3991 1943 1755
980 1755 139 7073 665 1280 -3137 -92 5539 90 -6642 -2581 7613 -3246 -2786 5246 2802 576 316
997 316 5419 933 -7778 -1805 13242 2715 -7166 -6873 -2891 324 -464 -366 650 -1876 -2339 5021 3644 137
1015 137 -4968 -1628 3372 -8397 -3427 247 -2981 7054
1023 7054
##PAGE= T1=  0.2631579E-02
##FIRST=  0.1144165E-03,  0.000000    ,       -260,      -4576
##DATA TABLE= (T2++(R..R)), PROFILE   $$ Real data points
0 -11 -8125 -13901 11986 4321 -11989 8576 4091 -6989 4980 -2862 -1186 10697 -9201 -1737 15580 -2544
16 -2544 -7732 10889 -5070 -4317 2761 -7664 10633 12336 -18627 -9225 14531 -8977 -7893 12128 -4927
31 -4927 -1111 1183 -13258 -1846 11120 -17379 8974 18661 -15950 -7259 9504 -1299 3494 -4086 1476
46 1476 12171 4598 -14651 6974 3675 -12495 4890 13315 -4897 3853 -7438 -6209 13965 -8522 -10558
61 -10558 8555 -1505 -11238 -173 3164 -3291 665 -4771 -1644 10134 -5341 -3444 11163 -2601 -12164
76 -12164 2814 1737 1443 -4526 -3900 -1225 10642 -10458 3388 9616 -6574 -9912 9971 779 1481 -4935
92 -4935 -5043 8473 -328 -13781 -4652 16731 -12334 -6741 7912 3514 -2401 4746 -8356 4463 -2160 -12371
108 -12371 8383 14878 -11349 -256 8232 -791 600 -3200 -2119 6672 1015 -6079 9284 7156 -10798
123 -10798 -4329 12036 -6275 -2038 1383 5246 13654 -3712 -11841 12144 2197 -8941 6558 6265 2605
138 2605 -1631 -5889 -2572 5468 -7409 1198 12851 -3725 -4076 5808 8300 451 -1740 -1045 9759 -66
154 -66 -11271 -5243 9150 -2679 -5776 4465 -740 -4557 2101 4030 5125 2729 -10957 3193 2077 -1200
170 -1200 -1255 833 6330 -2732 4513 358 4269 -3014 -3241 4190 1522 -5578 -3298 5389 1693 -3496 2818 -744
188 -744 337 -8307 -9372 7451 1087 -172 1167 471 -3398 -3077 -549 6200 7865 -1322 1890 7937 -7696
205 -7696 -5448 -487 6673 1462 -10065 -3973 4527 765 -1459 70 4792 -2360 -3009 3536 128 -4556 -1467
222 -1467 1181 -2136 4996 -9823 720 4582 -1028 4322 982 2765 -3623 3694 3316 1974 2419 -4980 727
239 727 4446 -5588 4668 3668 1287 3403 -4639 -644 -4540 -5617 -8692 -623 3894 -2032 2747 5035 787
256 787 -2901 -3204 -3041 5961 2123 -1705 8047 2629 -7465 -1979 3790 1068 1051 2145 99 -6012 -5311 -2305
274 -2305 -865 3364 -5657 -3121 4536 -6015 -4316 2920 -1834 1739 3098 689 5021 5857 -990 1148 -986
291 -986 -4725 311 1767 217 -964 -3100 4300 2498 661 338 1975 2847 4342 4435 -1239 -3900 969 -8089
309 -8089 4709 3556 -1645 1110 1304 2026 -1711 437 300 3165 351 -8345 -7252 932 -3177 -3164 3459 -1720
327 -1720 3451 3689 -2533 -326 3009 3662 3583 -1625 -7344 1957 4583 346 4508 5118 -2563 1073 -1657 -4645
345 -4645 1614 1169 -738 -2587 2089 -2882 -578 1613 -755 3565 -1143 -8204 -844 4170 1324 7580 -4277
362 -4277 5040 -271 -1223 -4439 56 2581 -2157 -2473 -1160 -614 414 500 -693 1260 -3789 1676 -3016 1179
380 1179 787 2313 1194 -10310 5302 -7115 -3347 142 -2229 2315 -1095 -3917 2152 5511 4619 7100 -1368
397 -1368 4933 1830 -4064 -4182 -2206 6811 1427 4634 3017 2501 4424 -729 -4365 3119 -6844 -1113 171
414 171 3736 -1805 -28 4897 -4456 -1122 -4099 -942 -1956 -4762 -932 -940 798 -3308 -4331 5193 995 6503
432 6503 -47 -408 8303 -2415 -1273 -8786 4011 -469 3158 -1946 2836 6232 939 4049 2034 -2864 1995
449 1995 -767 1615 579 -3927 3207 5697 1092 1886 -3268 2015 -272 -631 -3999 2064 -1950 -5070 -4411 -3613
467 -3613 -2441 -532 -3732 -6357 -1771 -2976 4509 8876 3696 3546 3609 -2823 -1700 8370 3454 3008 -7243
484 -7243 2416 -1185 -1898 -5526 2006 4322 -978 -3068 -1630 -4812 948 -4342 -2136 -3102 -3539 2515 5499 1486
502 1486 5824 -609 -2898 2506 1889 -1246 3258 5894 -3016 -1357 1784 584 -3321 -5225 922 -1330 3075
519 3075 4539 -1859 4349 -2891 2601 3991 -3796 -1626 101 -2203 -5232 -1056 -5221 2063 7251 -3422 1068
536 1068 -3122 1419 -1350 4352 1037 4115 3154 -4203 3194 -3426 4853 -2206 5084 -330 435 1293 4513 3877
554 3877 6169 -8603 3404 2889 335 -5746 -576 -2062 -1521 -6909 -982 -696 -1783 -4474 4587 -2190 -1493
571 -1493 801 2707 -6365 -726 -2564 3096 4434 -8930 -3326 322 -124 -3959 3481 3231 -1442 1583 -3603
588 -3603 -1928 -808 406 -2858 149 3122 -3372 967 -786 5025 -4465 -3455 5421 901 -1288 -5720 -181
605 -181 -3396 -6057 2740 2313 527 432 -3846 -2691 -2752 -6324 3774 254 -2724 -7724 3497 -2233 991 2632
623 2632 2693 -5727 -6385 -7503 -1419 275 -4522 2962 832 -1234 372 3514 4958 3716 -176 -4823 5884
640 5884 -3335 -7082 6178 1018 -5298 4727 618 593 1527 -2756 -5043 3253 1336 -1122 380 144 -8784
657 -8784 -2142 1195 3458 -2510 -4819 -3902 4540 -2512 -7913 4666 -1735 -30 -6148 -6323 -6255 2215 4654 -3601
675 -3601 3116 2008 -1334 4110 -2774 98 -422 -3485 2420 -1504 225 744 5517 988 691 -3518 -2219 1507
693 1507 3043 3944 157 6208 -5479 -888 706 5790 3799 -5648 -10100 3551 -4457 -2910 4279 2744 2775
710 2775 4570 1851 -3072 -2336 1369 -2445 4005 -3780 -1833 5500 -2408 -7395 1354 -3063 -295 -3354 3428
727 3428 -1902 1195 -699 -3260 822 -2986 -2123 2482 -454 1788 3171 -1100 -829 597 -3550 281 7696
744 7696 -2198 1607 4971 -6751 8089 -2116 5704 547 11551 -1337 -1260 3017 -4780 2055 2652 -6169
760 -6169 -2018 -780 10105 -5 4846 -4565 2780 1870 -2393 3736 1788 1271 3556 3804 343 2438 -648
777 -648 -1946 11019 -6160 -3650 2247 -658 4087 -5205 8892 823 -1713 -2296 1793 1679 395 2075 475
794 475 7314 -843 -9241 -997 5454 -985 -6512 -2803 -2879 -51 2013 373 2502 5619 1301 -4308 4758 -1811
812 -1811 -5303 -6955 3430 1338 -877 978 6023 -1149 3722 3124 -994 -1181 -2288 3730 -8831 3144 -1084
829 -1084 -1242 3284 -1374 -5379 -3867 -2292 2642 205 351 -369 369 -3011 -2010 -2510 4722 -591 -218 6571
847 6571 -2353 -1722 -2266 -2099 -2876 -3875 -3062 908 835 -3027 605 -343 -1111 5061 -1729 -359 -1281 -2897 1508 -4082
867 -4082 -6182 -1398 3693 -320 3464 -1211 -3185 -2610 2278 -198 -5331 -2511 3046 -2688 -5732 3726 4732
884 4732 -566 -268 2386 -7839 700 -1386 -222 -4745 -3675 6669 762 -3717 -2450 2144 5384 -326 -2219
901 -2219 839 -3501 -5887 1146 -1443 -1207 -1568 -1419 2054 3945 -7348 -938 7114 -105 2060 6411 -4333
918 -4333 -2712 7108 -1060 4276 741 -1066 1611 3476 6286 -4463 -1151 690 -743 -4382 8278 1632
934 1632 -2973 -493 859 -3432 4353 1301 -6071 1471 -3594 -1446 671 4907 -7173 2496 3546 5391 742
951 742 -2410 1071 -41 1203 -9990 3777 -1200 -736 -3623 5251 -609 -166 -4623 418 -521 2244 -1581
968 -1581 3004 -2471 -5097 -853 3545 -5038 2849 -6165 1615 2201 -5204 -2736 1559 -989 -941 319 6182 55
986 55 2638 8353 1896 2195 1262 -5294 6590 1797 -7130 -1707 5801 -471 833 196 690 4235 1871 964
1004 964 991 -967 3339 477 -1408 939 2696 1137 4503 273 -3223 4697 1559 -3250 -4964 7822 6668
1021 6668 636 -2735
1023 -2735
##PAGE= T1=  0.2631579E-02
##FIRST=  0.1144165E-03,  0.000000    ,       -260,      -4576
##DATA TABLE= (T2++(I..I)), PROFILE   $$ Imaginary data points
0 -216 -9382 4409 5201 -20719 336 9821 -6174 -3742 -3958 -5969 9823 -1194 -18073 18389 -164 -17543
16 -17543 15092 7176 -8688 9573 481 -2683 14293 -5955 -9728 22224 -6366 -19478 17606 9288 -16531
31 -16531 10855 1379 -2137 10170 -10713 -7020 14237 -12327 -14105 17318 -2518 -4674 6758 -4113 14275
46 14275 9365 -15158 4305 13038 -19342 -4202 19770 -6270 -13261 -1227 2383 3181 -850 -9251 3374
61 3374 4443 -14650 3687 8866 714 3518 -605 -1415 13971 -7948 -9626 10567 2659 -13670 5273 13442
77 13442 -1433 2889 -1211 2202 6526 -11925 -9851 12080 -5316 -16644 16902 2013 -9330 -2186 2715
92 2715 2493 5311 -6438 -5288 8990 -4867 -6966 10823 1451 -7451 -5275 -2393 731 6815 -3759 102
108 102 9081 -8725 -10237 11085 -2704 -7448 -250 -8882 5729 -2185 -7199 6794 10139 -12680 -3406 3546
124 3546 -4183 -4935 1535 6380 3513 -5047 -7724 12204 5574 -9190 453 7166 4064 1565 -6759 5282
140 5282 7642 -6318 1068 11097 -3639 -7803 5272 4902 -5504 -201 4016 5087 7830 -16424 6837
155 6837 12397 -5220 -8472 12427 7786 -2736 -3209 -7592 3910 7365 -7961 7618 2557 -10441 -3019
170 -3019 8202 2495 2074 -1151 -9 9650 984 -14238 7155 5109 -7426 -4595 6917 -5010 190 -2499
186 -2499 6134 4356 -7706 -3124 5670 5948 -3042 1068 2748 3897 -2547 -218 6782 -1377 -3797 -7285 3999
203 3999 8337 -5754 -2102 -73 877 -8810 -5240 5216 -1025 -9489 1604 7040 2168 -6437 -435 7646
219 7646 292 -4332 -3705 693 -2291 -8753 393 6973 -8569 -553 2588 4942 -6268 -3054 1385 3623 -2425
236 -2425 -1272 -4338 12262 -1564 -5301 7107 6418 -12261 3157 8 1939 1071 -6725 -2100 1024 -3345
252 -3345 -5325 4501 349 -5173 -2223 -3844 -2556 2182 -3412 -1718 3110 -6244 2044 7510 -1604 -5732 -2337
269 -2337 1050 4948 -6478 -4428 1767 -1029 -3531 -1597 6522 1274 -2480 7211 2463 3544 -5843 2612 47
286 47 5005 809 -2833 7323 -5679 -2709 649 -2617 -3395 5638 -599 2846 -3435 -8250 -2314 -6168 -10944
303 -10944 3237 4539 3218 -2957 -2582 -2262 1201 -2803 -1400 4809 -6253 -2962 3290 -4367 5584 2114 -401
320 -401 6912 1672 -4733 -5444 2307 -681 160 -5355 -6416 5798 2838 -6069 1273 4528 -4656 -4017 554 -3915
338 -3915 2434 1837 2797 1056 -3262 -4357 -4057 10830 -5525 988 -1032 -2393 -4008 -846 191 -1201 -7457
355 -7457 87 4079 -8626 -701 8745 -2552 -3202 -2695 2226 10198 -5650 1405 4977 677 8520 -2515
371 -2515 1187 7305 5008 7264 4407 7416 -79 -768 -1025 -1253 2023 467 -2478 -1175 7707 2101 -1126 -380
389 -380 -116 -4184 219 5904 -1800 1861 2892 -6559 2253 -2167 2123 -1822 7730 -4145 2330 8160 7215
406 7215 -4897 -7670 3480 -3779 655 867 1498 -403 1018 1207 -1932 4827 -5104 16 -2097 5486 819
423 819 2686 9188 3811 -3627 46 4529 -174 5565 2503 -1453 -3215 -2624 -1708 -3873 -1522 -651 -1484 616
441 616 -3258 -1840 -2559 -3668 -5956 -523 -272 1214 2681 1485 6566 -999 -6931 8875 -317 3174 810
458 810 -2463 -4322 -1993 1021 -1675 1688 -277 6452 3032 1676 2579 1063 -2252 608 -1720 -3713 2067
475 2067 -4685 -5309 -1673 -2569 760 776 4392 1053 -1239 861 1413 -7 315 -1126 -724 23 -4815 1439 -5835
494 -5835 -4138 -8195 -4027 3311 5409 -1089 2639 -9642 -1301 2170 6070 4362 635 2174 1783 6079 -2931
511 -2931 -3937 -3784 6090 -5873 -504 1822 398 -1170 360 9761 -282 -13257 -429 7684 -6011 -5
527 -5 -503 -9274 1483 -1515 4777 7218 -5703 -675 6492 -2823 2213 -787 4229 -7936 1698 -2299 6272
544 6272 -633 3149 951 554 -209 -3503 5530 -956 6227 478 -11 9246 5918 -6027 -22 175 -10785
561 -10785 -7078 -259 1642 841 -5640 -3131 1453 -3047 -10417 -1211 1416 -1223 -160 1994 -1592 4601 -1000
578 -1000 -8269 5267 5754 -522 3071 6077 -1107 1479 -2552 -3322 4405 -6002 6380 2814 -2558 -4685 2348
595 2348 12351 -964 -2807 -685 2209 2957 -2929 1618 1737 2535 -1671 9907 -3092 -8395 -8024 -1001 -2572
612 -2572 -2630 -2641 -5977 5798 -6215 1086 9024 -2061 -10493 4780 175 1155 9903 -3797 -2249 227 -1248
629 -1248 -2314 4630 6918 77 3514 -2132 690 3707 -4119 -83 -2165 -590 -1171 3817 2035 5369 632
646 632 -996 5827 -154 869 -3392 -1878 -3287 3207 -650 -5766 1941 -3241 1085 3294 -958 1433 9509
663 9509 424 4499 6698 660 2941 -4623 -1877 -2809 6111 -2723 6692 6257 2577 -5629 1680 6235 288
680 288 -4114 206 -1066 554 541 -4304 5479 -233 4599 6870 3441 -681 4079 -2978 4281 -1390 -2882 -358
698 -358 5113 380 -2564 -194 1299 2243 -6215 47 3540 -5392 -4277 3544 -3194 -4164 -2469 -3108 -10489 -1931
716 -1931 4141 -3111 2088 -1820 3844 -3538 780 -2731 3470 -1575 9257 2056 617 -698 465 -1831 3846
733 3846 2793 -1652 -3086 3184 3367 -3890 -3696 1540 1490 3570 -3273 -687 5142 -1357 -2560 157 -2687 -1695
751 -1695 2158 -113 7980 1594 3498 2463 2709 493 -4637 4049 -3469 -4516 -7352 3213 -5917 512 2211
768 2211 -522 5319 2927 140 -3626 -1770 5856 2441 -2686 -2014 56 -5390 -3658 8027 771 -36 7877
785 7877 -1131 1705 357 1566 1561 -494 -3537 2457 -48 1108 953 -1891 3735 235 452 -4905 -549 1247
803 1247 3029 -4625 2176 -1375 -2435 1415 -5649 10149 -395 8958 -3067 3646 5073 5948 358 2446
819 2446 -4069 -1391 -6408 -4563 2636 -5438 7857 -3267 -7635 -6552 1967 2774 -4937 -6397 6135 4301
835 4301 1354 -4501 1655 -4039 -2766 -3367 3076 1297 -7073 4496 2462 1855 -4150 -3660 -61 2500 -6708
852 -6708 -3099 1699 -462 -1500 1880 -578 -5622 -1134 905 -8406 -8007 -1692 3854 4530 -3079 -1731 -1729 2188
870 2188 -3268 1250 2335 -894 5564 -1563 -188 -1960 -3567 427 -2139 10221 -256 -1232 1833 -2827 -725
887 -725 1430 2533 -7859 -3543 -362 -185 2245 -2432 -3409 -524 6607 -996 -1074 4998 2824 -1217 2892 5043
905 5043 -1992 -4975 658 4434 -519 -392 -4262 5009 998 5626 -853 6068 2231 1626 -9084 10042 8175
922 8175 -6011 5798 -2196 3018 2846 -3745 4501 7548 -5920 -347 8352 -2061 -3807 1761 -2852 6615
$$ [...]
1023f22
##END NTUPLES= nD NMR FID     
##END=
