##TITLE=EXAMPLE JCAMP-DX FILE FOR IMS
##JCAMP-DX=5.01                                $$ ISAS JCAMP-DX program for IMS (V.1.0)
##DATA TYPE=ION MOBILITY SPECTRUM
##DATA CLASS=XYDATA
##ORIGIN=J.I.Baumbach, H. Schmidt, ISAS Dortmund, Germany
##OWNER=COPYRIGHT (C) 2000 by ISAS Dortmund, Germany
##LONG DATE=2000/09/28 14:24:38 +0100
##SOURCE REFERENCE=P:\Hartwig\Messung\000928\H1092801
##SPECTROMETER/DATA SYSTEM=ISAS/TE/TE-lang
##NAMES=Tetrachloroethene
##CAS REGISTRY NO=127-18-4
##CONCENTRATIONS=(NCU)
(TETRACHLOROETHENE, 0.46, ppmv)
##.IMS PRESSURE=101
##.CARRIER GAS=NITROGEN
##.DRIFT GAS=NITROGEN
##.ELECTRIC FIELD=-158,-294
##.ION POLARITY=NEGATIVE
##.IONIZATION MODE=PD
##.IMS TEMPERATURE=25.0
##.SHUTTER OPENING TIME=300
##.IONIZATION CHAMBER=CYL,30,7.5
##.IONIZATION SOURCE= Partial Discharge, Needle= Stainless Steel, Gap = 4.6 mm
##.DRIFT CHAMBER=CYL,120,7.5
##.CARRIER GAS FLOW=0.2
##.DRIFT GAS FLOW=0.11
##.CARRIER GAS MOISTURE=0.03
##.SHUTTER GRID POTENTIAL=100
##.REDUCED MOBILITY=(K,A)
(2.38, <tetrachloroethene>)
(2.27, <tetrachloroethene>)
(2.06, <tetrachloroethene>)
(1.83, <tetrachloroethene>)
##XUNITS=MILLISECONDS
##YUNITS=PICOAMPERES
##XLABEL=Drift Time / ms
##YLABEL=Ion Current / pA
##FIRSTX=0
##LASTX=59.975
##FIRSTY=0. 4491087E+01
##XFACTOR=0.1830348E-02
##YFACTOR=0.1037643E-01
##NPOINTS=2400
##XYDATA=(X++(Y..Y))
$$ plain form
0 433 202 11046 27578 32767 31172 28970 28491 28778 28928 29022 28928 28726 28683 28825 24017 6012 -2446 -2032 61 875
273 875 837 663 579 438 390 654 555 428 550 475 442 485 485 612 569 466 485 461 517 612 569 456 456 541 607 513 395 447 461 461
683 461 602 517 470 409 494 517 527 442 527 400 348 541 503 607 485 395 438 517 499 579 466 522 597 480 532 499 508 485 362 541
1093 541 532 654 503 438 372 438 635 466 395 405 513 588 621 574 320 532 466 513 574 485 372 579 550 513 626 480 480 367
1475 367 447 597 517 480 470 489 499 546 485 612 433 381 588 612 466 423 522 494 513 546 588 390 442 447 541 480 546 433 466 419
1885 419 503 588 579 494 353 541 522 583 442 499 442 433 532 560 536 456 452 438 517 541 517 419 442 527 522 645 428 386 480 461 466 414 541
2336 541 602 372 527 626 475 358 522 494 447 527 546 372 442 560 583 536 470 527 438 442 565 461 442 499 475 499 433 607
2718 607 555 541 456 452 541 645 433 395 579 470 452 438 517 593 372 456 565 579 612 461 414 461 499 433 508 550 433 334 626
$$ packed form
0D33k31J0844J6532N189j595k202m79K87J50R4r4k02m3J42m808j8005q458M14K093Q14
273H75l8j74q4j41m8K64r9j27J22p5l3M3%J27m3j03J9k4N6R5m3j13%Q5O6r4j18N2J4%
683D61J41q5m7o1Q5K3J0q5Q5j27n2J93l8J04j22r0M3P9j8Q0j13N6P5j17N2l3Rk3j23J79
1093E41rJ22j51o5o6O6J97j69p1J0J08P5L3m7k54K12o6M7O1q9j13K07k9l7J13j46%j13
1475C67Q0J50q0l7j0J9J0M7o1J27j79n2K07K4j46m3R9k8J9L3M2j98N2NR4o1O6j13L3m7
1885D19Q4Q5rq5j41J88j9O1j41N7n7rR9K8k4q0mj4P9K4k4r8K3Q5nJ23k17m2R4j9Nn2J27
2336E41O1k30J55R9j51j17J64k8m7Q0J9j74P0J18K3m7o6N7q9MJ23j04j9N7k4K4o6J74
2718F07n2j4q5mQ9J04k12l8J84j09j8j4P9P6k21Q4J09J4L3j51m7M7L8o6P5M2j17r9K92
$$ plain form
3114 626 621 565 390 409 513 546 513 452 428 428 536 517 499 508 423 480 438 513 569 461 409 376 475 560 607 456 456 541 503 593 541 423
3551 423 423 517 536 353 583 574 466 513 475 560 513 405 499 461 508 503 508 386 367 602 517 517 475 527 527 560 522 503 508 499 409 409 579 621
4016 621 485 405 409 513 555 517 489 499 475 438 456 593 466 447 438 513 541 480 466 419 602 579 480 569 494 381 400 560 508 536
4425 536 536 414 400 513 574 607 461 442 508 400 541 583 466 499 433 475 607 466 456 447 489 550 621 555 461 339 442 607
4808 607 635 461 475 353 409 659 517 527 461 447 485 494 560 499 480 376 452 692 517 447 358 452 616 546 480 452 522 428 485
5204 485 607 593 386 395 541 428 494 560 485 466 499 475 442 583 372 419 503 503 626 550 419 372 593 546 532 550 532 296 470
5600 470 579 461 574 461 442 522 475 428 461 475 409 560 508 513 527 390 409 607 593 475 466 405 475 447 541 645 461 466 329
5996 329 503 621 527 546 376 489 508 513 522 438 452 438 438 597 569 475 320 461 546 508 536 541 433 517 470 555 409 381 527 555
$$ packed form
3114F26nn6j75J9J04L3l3o1k4%J08j9j8Rq5N7m2P5N6j08n2l3R9Q5M7j51%Q5l8R0n2j18
3551D23%R4J9j83K30rj08M7l8Q5m7j08R4l8M7nNj22j9K35q5%m2N2%L3l8j9Nrr0%J70M2
4016F21j36q0MJ04M2l8k8J0k4l7J8J37j27j9rP5K8o1j4m7J83k3r9Q9p5j13J9J60n2K8
4425E36%j22j4J13O1L3j46j9O6j08J41M2j17L3o6M2J32j41j0rM2O1P1o6r4j22J03J65
4808F07K8j74J4j22N6K50j42J0o6j4L8RO6o1j9j04P6K40j75p0q9R4J64p0o6k8P0r4N7
5204D85J22j4k07RJ46j13O6Tp5j9L3k4l3J41k11M7Q4%J23p6j31m7K21m7j4J8j8k36J74
5600D70J09j18J13j13j9Q0m7TL3J4o6J51n2NJ4j37J9J98j4j18ro1P0k8R4J04j84Nj37
5996C29J74J18r4J9j70J13J9NRq4J4j4%J59k8r4j55J41Q5l8K8Nj08Q4m7Q5j46k8J46K8
$$ plain form
6406 555 579 470 546 390 565 508 489 579 470 489 489 517 456 452 485 442 546 438 550 541 409 560 583 414 499 428 480 442 546
6802 546 550 485 602 489 339 503 527 555 522 522 485 560 569 390 456 541 565 546 409 532 513 503 532 419 527 517 400 456 532
7198 532 550 470 663 466 522 461 447 517 560 513 513 480 456 616 400 480 447 470 489 536 527 546 475 499 569 466 466 456 489 475 513 489
7635 489 550 494 522 447 466 579 621 532 386 306 532 560 569 583 428 452 499 513 527 668 423 386 485 466 602 466 470 536 499 597
8045 597 499 428 532 560 508 517 461 565 466 550 602 560 456 517 485 513 560 480 452 470 536 550 452 583 456 470 532 541 588 527 654
8468 654 560 583 616 654 800 823 917 1153 1444 1924 2249 2691 3237 3660 4102 4469 4756 4832 4935 5015 5100 5076 4996 4864 4596 4756
8823 4756 4850 4681 4747 4582 4474 4436 4587 4408 4107 4055 3971 4051 3933 4013 4521 5048 5951 7584 9183 11385 13667 16202
9124 16202 18559 20813 22643 23875 24619 24915 24793 24384 23584 22332 20916 19326 17868 16296 14946 13676 12552
$$ packed form
6406E55K4j09P6j56J75n7j9R0j09J9%K8o1mL3m3J04j08J12rj32J51K3j69Q5p1N2l8J04
6802E46Mo5J17j13j50J64K4K8l3%l7P5Rj79O6Q5K4j9j37J23j9j0K9j13J08j0j17N6P6
7198E32J8q0J93j97N6o1j4P0M3m7%l3k4J60k16Q0l3K3J9M7rJ9p1K4P0j03%j0L3j4L8k4
7635D89O1n6K8p5J9J13M2q9j46q0K26K8RJ4j55K4M7J4TJ41k45l7R9j9J36j36MO6l7R8
8045E97r8p1J04K8n2Rn6J04r9Q4N2m2j04O1l2K8M7q0k8J8O6J4r8J31j27J4O2RM7o1J27
8468F54r4K3L3L8J46K3R4K36K91M80L25M42N46M23M42L67K87P6J03Q0Q5k4q0j32k68J60
8823D756R4j69O6j65j08l8J51j79l01n2q4Q0j18Q0N08N27R03J633J599K202K282K535
9124A6202K357K254J830J232P44K96j22m09q00j252j416j590j458j572j350j270j124
$$ plain form
9356 12552 11512 10731 10270 9738 9418 9066 8774 8435 8548 8294 8002 7988 7786 7687 7711 7480 7377 7217 6953 6713 6596 6337
9657 6337 6116 5740 5556 5410 5236 5071 4850 4723 4521 4488 4342 4403 4201 4055 3985 4140 4211 4088 4159 4192 4328 4737 4921 5057
9984 5057 5307 5660 6154 6577 7118 7480 7889 8144 8369 8431 8374 8289 7908 7377 6934 6408 5928 5269 4822 4342 4013 3613 3392
10299 3392 3317 3030 2879 2804 2710 2780 2682 2653 2635 2616 2837 2931 3020 2893 2893 3143 3072 3251 3180 3077 3114 3001 3251 3166 3030 3011 3072
10667 3072 3011 3058 2954 2907 2809 2954 2898 2865 2851 2912 2776 2729 2710 2747 2705 2583 2508 2559 2559 2667 2531 2522 2635 2555 2649 2484 2470 2522 2592
11063 2592 2503 2696 2602 2667 2658 2635 2691 2874 2889 2813 2907 3053 3176 3096 3392 3411 3528 3622 3853 4018 4022 4145 4004 3994 4055 3957 3877 3632
11446 3632 3336 3265 2983 2992 2884 2630 2503 2470 2540 2484 2333 2343 2324 2338 2376 2305 2202 2282 2249 2178 2225 2286 2173 2112 2065 2197 2310
11815 2310 2155 2117 2070 2141 2084 2169 2225 2235 2301 2301 2131 2183 2508 2508 2301 2428 2442 2329 2399 2380 2385 2286 2249 2380 2451 2206 2094 2253
$$ packed form
9356A2552j040p81m61n32l20l52k92l39J13k54k92j4k02r9K4k31j03j60k64k40j17k59
9657F337k21l76j84j46j74j65k21j27k02l3j46O1k02j46p0J55P1j23P1L3J36M09J84J36
9984E057K50L53M94M23N41L62M09K55K25O2n7q5l81n31m43n26m80o59m47m80l29m00k21
10299C392p5k87j51p5r4P0r8k9j8j9K21R4Q9j27%K50p1J79p1j03L7j13K50q5j36j9O1
10667C072o1M7j04m7r8J45n6l3j4O1j36m7j9L7m2j22p5N1%J08j36rJ13q0R4j65j4N2P0
11063B592q9J93r4O5rk3N6J83J5p6R4J46J23q0K96J9J17R4K31J65MJ23j41j0O1r8q0k45
11446C632k96p1k82Rj08k54j27l3P0n6j51J0j9J4L8p1j03Q0l3p1M7O1j13o1m7J32J13
11815B310j55l8m7P1n7Q5N6J0O6%j70N2L25%k07J27J4j13P0j9Nr9l7J31P1k45j12J59
$$ plain form
12197 2253 2192 2131 2173 2018 1938 1872 2136 2037 2032 2009 1957 1924 1971 1999 2169 2065 2014 2277 2197 2183 2286 2301 2371 2413 2352 2333 2456 2409 2329
12593 2329 2150 2263 2253 2188 2089 1971 2046 2061 1971 1943 1759 1774 1802 1882 1877 1745 1661 1783 1717 1736 1797 1769 1642 1684 1712 1741 1778 1764 1642
12989 1642 1651 1647 1755 1807 1661 1661 1670 1609 1534 1755 1684 1675 1788 1731 1901 1896 1887 1792 1868 1915 2042 1919 1821 1854 1896 1736 1891 1811 1694 1698 1703
13413 1703 1609 1585 1600 1421 1534 1378 1515 1538 1487 1345 1369 1421 1435 1430 1388 1313 1374 1473 1463 1468 1411 1407 1482 1454 1378 1505 1388 1411 1407 1444
13823 1444 1383 1360 1468 1303 1364 1369 1430 1336 1270 1416 1383 1331 1336 1421 1336 1331 1266 1298 1308 1454 1322 1228 1280 1336 1308 1308 1317 1266 1298 1341 1407 1421
14260 1421 1317 1270 1388 1336 1397 1473 1355 1374 1322 1280 1331 1331 1275 1256 1233 1313 1411 1374 1148 1115 1251 1237 1350 1209 1167 1110 1251 1237 1223
14656 1223 1294 1256 1162 1190 1313 1138 1261 1275 1096 1087 1256 1298 1068 1228 1280 1218 1228 1153 1153 1195 1247 1214 1181 1233 1120 1110 1200 1261 1186
15052 1186 1256 1195 1077 1091 1218 1214 997 1054 1101 1026 993 1237 1087 1030 1016 1049 1073 1129 1077 1011 1021 1026 1059 1091 1124 1040 960 974 1115 1106
$$ packed form
12197B253o1TM2j55q0o6K64r9nk3n2l3M7K8J70j04n1K63q0j4J03J5P0M2o1j9J23m7q0
12593B329j79J13j0o5r9j18P5J5r0k8j84J5K8Q0nj32q4J22o6J9O1k8j27M2K8K9L7j4j22
12989A642RmJ08N2j46%Ro1p5K21p1rJ13n7J70nrr5P6M7J27j23r8L3M2j60J55q0j17MN
13413A703r4k4J5j79J13j56J37K3n1j42K4N2J4nm2p5O1R9j0Nn7mP5k8p6J27j17K3mL7
13823A444o1k3J08j65O1NO1r4o6J46l3n2NQ5q5no5L2J0J46j32r4N2N6k8%Rn1L2M3O6J4
14260A421j04m7J18n2O1P6j18J9n2m2N1%n6j9k3Q0R8l7k26l3J36j4J13j41m2n7J41j4T
14656A223P1l8r4K8J23j75J23J4j79rJ69M2k30J60N2o2J0p5%M2N2l3TN2j13j0R0O1p5
15052A186P0o1j18J4J27mk17N7M7p5l3K44j50n7j4L3K4N6n2o6J0NL3L2L3q4q0J4J41r
$$ plain form
15462 1106 1063 1016 1073 997 1068 1148 1049 1016 1073 1143 1106 983 1186 955 1115 1087 1157 1124 1073 1049 1002 1054 1153 1054 1011 960 997 1124 1096
15858 1096 983 979 889 983 1073 1040 1148 983 997 979 823 1007 1011 1007 988 979 1035 997 974 875 880 927 997 1049 974 866 899 908 1040 1044 960 1040
16295 1040 964 875 1054 1063 1073 917 852 1063 979 1026 969 955 861 884 1035 1026 757 809 856 936 1026 960 974 852 941 941 870 837 913 908 899
16718 899 837 936 936 941 870 804 936 913 884 903 861 833 870 997 852 786 913 1007 960 931 946 866 875 837 823 1016 913 762 809 870
17128 870 988 866 819 790 795 913 866 889 884 767 748 804 927 889 833 852 767 762 837 828 866 804 790 828 894 790 734 809 922 781
17538 781 842 861 842 767 739 936 899 856 866 743 781 833 842 772 819 852 649 870 861 790 729 715 856 960 814 701 800 739 795
17934 795 762 946 833 630 772 748 795 762 819 729 701 833 772 828 795 739 687 743 870 899 748 673 677 837 748 762 724 724 706
18330 706 753 729 781 762 663 739 875 889 776 621 762 696 800 847 729 612 762 701 790 847 757 687 579 870 833 870 781
$$ packed form
15462A106m3m7N7p6P1Q0r9l3N7P0l7j23K03k31J60k8P0l3n1k4m7N2R9r9m3n1L7J27k8
15858A096j13mr0R4R0l3J08j65J4j8j56J84Mmj9rN6l8k3r9NM7P0N2p5j08L3RJ32Mq4Q0
16295A040p6q9J79RJ0j56o5K11q4M7n7j4r4K3J51rk69N2M7Q0R0o6J4j22Q9%p1l3P6nr
16718H99o2R9%Np1o6J32k3k9J9m2k8L7J27j45o6J27R4m7k9J5q0Rl8j4J93j03j51M7O1
17128H70J18j22m7k9NJ18m7K3nj17j9N6J23l8n6J9q5nP5rL8o2j4L8O6j04n6P5J13j41
17538G81O1J9j9p5k8J97l7m3J0j23L8N2Rp0M7L3k03K21rp1o1j4J41J04j46j13R9o1N6
17934G95l3J84j13k03J42k4M7l3N7r0k8J32o1N6l3n6n2N6J27K9j51p5MJ60q9J4l8%j8
18330G06M7k4N2j9r9P6J36J4j13j55J41o6J04M7j18j17J50o1Q9N7r0p0j08K91l7L7q9
$$ plain form
18699 781 645 682 809 866 767 682 673 753 767 786 767 724 781 616 701 837 786 828 757 621 654 866 757 706 677 790 701 786 804
19095 804 607 659 673 739 729 781 579 687 762 757 748 715 612 593 795 776 640 795 706 630 701 630 800 715 621 710 616 635 804
19491 804 687 574 654 724 616 762 715 673 720 781 701 772 682 602 673 654 786 720 757 550 602 663 706 687 612 692 654 682 692
19887 692 757 677 517 668 724 762 720 626 560 640 607 626 734 616 569 569 626 734 621 701 503 597 607 621 663 715 630 574 673
20283 673 588 621 593 677 597 597 729 767 616 621 550 654 630 668 555 569 654 743 677 626 579 550 583 677 649 522 621 593 565 583 579 659
20720 659 626 630 710 640 555 574 489 569 710 682 597 583 466 541 663 659 696 654 574 522 645 659 640 522 513 555 616 640 532 607 692
21144 692 588 659 630 616 626 508 654 682 527 696 579 588 673 616 541 635 612 550 602 809 569 503 532 541 536 583 583 626 532 546
21553 546 635 673 645 527 565 565 560 555 612 593 494 550 710 602 616 555 527 560 541 597 583 536 583 682 527 588 536 640 597 480 682
$$ packed form
18699G81j36L7J27N7r9q5rQ0J4J9j9m3N7j65Q5J36n1M2p1j36L3K12j09n1k9J13q9Q5J8
19095H04j97N2J4O6j0N2k02J08P5nrl3j03j9K02j9j36J55q9p6P1p1J70q5r4Q9r4J9J69
19491H04j17j13Q0P0j08J46m7m2M7O1q0P1r0q0P1j9J32o6L7k07N2O1M3j9p5Q0l8K8J0
19887F92O5q0j60J51N6L8m2r4o6Q0l3J9J08j18m7%N7J08j13Q0j98R4J0J4M2N2q5n6R9
20283F73q5L3k8Q4q0%J32L8j51Np1J04k4L8j13J4Q5Q9o6n1m7k9L3R4k8j27R9k8TJ8mQ0
20720F59l3MQ0p0q5J9q5Q0J41k8q5j4j17P5J22mL7m2q0n2J23J4j9j18rM2O1K4j08P5Q5
21144F92j04P1k9j4J0j18J46K8j55J69j17RQ5n7p5R4k3o2N2K07k40o6K9RnM7%M3r4J4
21553E46Q9L8k8j18L8%nTN7j9r9N6J60j08J4o1k8L3j9N6j4m7M7R9j55O1n2J04m3j17K02
$$ plain form
21977 682 649 532 541 550 612 621 612 635 513 550 456 565 593 588 574 541 574 480 560 612 532 546 569 536 640 470 428 569 579 597 574 569
22414 569 532 461 579 612 550 517 513 485 645 541 560 456 560 569 485 541 616 419 499 663 508 489 649 513 541 612 517 649
22796 649 701 513 461 546 574 593 621 536 499 532 616 536 546 499 456 532 635 546 475 588 470 532 593 654 588 381 550 588 602 541
23206 541 452 456 597 546 550 508 499 461 517 503 701 579 433 503 466 536 767 574 461 489 550 555 574 593 489 503 565 616 588 555 452
23629 452 461 607 630 508 522 508 541 626 550 546 508 541 517 565 480 555 466 527 527 532 546 489 616 447 527 532 532 522 583 409 452 541 640
24080 640 508 499 489 546 574 626 503 536 485 593 517 579 583 522 367 536 461 677 536 602 414 461 489 612 550 452 532 508 433
24476 433 607 470 386 541 626 513 569 574 503 456 480 612 583 508 485 485 550 687 489 499 423 527 550 546 452 513 513 489 565 541
24886 541 536 489 499 489 494 475 532 593 438 550 517 569 517 517 485 494 461 536 612 470 522 583 579 405 541 522 499 452 527 546 522 532
$$ packed form
21977F82l3j17RTO2RrK3j22L7r4J09K8nj4l3L3r4Q0N2q0J4K3l3J04j70m2J41J0J8k3n
22414E69l7p1J18L3o2l3mk8J60j04J9j04J04Rq4N6P5j97Q0J64j55j9J60j36K8P1r5J32
22796F49N2j88n2Q5K8J9K8q5l7L3Q4q0J0m7m3P6J03q9p1J13j18O2O1To6k07J69L8J4o1
23206E41q9MJ41n1Mm2rl8N6j4J98j22j46P0l7P0K31j93j13K8O1NJ9Tj04J4O2N1k8l3j03
23629D52RJ46K3j22J4j4L3Q5p6ml8L3k4M8q5P5q9O1%NJ4n7J27j69Q0N%j0O1j74M3Q9R9
24080F40j32rj0N7K8N2j23L3n1J08p6O2Mo1j55J69p5K16j41O6j88M7K8J23o2r8Q0k4p5
24476D33J74j37q4J55Q5j13N6Np1m7K4J32k9p5k3%O5J37j98J0p6J04K3mr4O1%k4P6k4
24886E41nm7J0j0Nj9N7O1j55J12l3N2n2%l2Rl3P5P6j42N2O1mj74J36j9k3m7P5J9k4J0
$$ plain form
25323 532 409 470 574 536 442 456 503 574 513 541 593 461 470 579 560 485 499 438 461 494 560 574 470 423 522 569 630 485 447 470
25733 470 470 588 452 560 438 428 489 522 569 508 358 522 532 513 522 527 546 588 503 612 522 503 508 466 470 569 480 574 466 405 602
26156 602 597 452 517 456 532 480 588 541 485 517 485 433 536 541 522 386 480 522 565 433 532 574 395 489 508 597 635 499 358
26552 358 414 692 499 447 362 499 513 532 583 527 532 414 517 546 499 456 499 517 588 560 527 470 522 470 574 494 503 494 546 428
26962 428 489 668 583 282 423 546 626 456 522 499 579 569 452 485 527 466 470 414 616 555 499 405 536 569 522 503 494 508 433
27358 433 489 654 423 494 433 503 499 593 489 452 503 428 494 588 517 452 348 602 597 499 447 499 428 423 513 640 555 470 480 428 579
27782 579 583 522 414 438 513 588 480 499 550 532 390 546 645 546 466 438 358 456 635 461 461 442 489 569 503 555 485 456 447 433 588
28205 588 522 517 273 513 517 475 503 456 532 489 513 555 423 428 475 569 485 555 419 414 579 499 541 466 456 447 546 612 456 532 480 400
$$ packed form
25323E32j23O1J04l8r4J4M7P1o1K8N2j32RJ09j9p5J4o1K3L3O6J4j04m7R9M7O1j45l8K3
25733D70%J18j36J08j22j0O1L3M7o1j50J64J0j9RNJ9M2q5J09r0j9Nm2MR9q9R4j08o1J97
26156F02nj45O5o1P6n2J08m7n6L2l2n2J03Nj9j36R4M2M3j32R9M2j79R4J9Q9L8j36j41
26552C58N6K78j93n2q5J37J4J9N1n6Nj18J03K9m7m3M3J8P1k8l3n7N2n2J04q0RrN2j18
26962D28O1J79q5l01J41J23Q0j70O6k3Q0j0j17L3M2o1Mn6K02o1n6r4J31L3m7j9rJ4p5
27358D33N6J65k31P1o1P0mR4j04l7N1p5O6R4p1o5j04K54nr8n2N2p1nR0J27q5TJ0n2J51
27782E79Mo1j08K4P5Tj08J9N1j8j42J56R9r9q0k8q0R8J79j74%j9M7Q0o6N2p0k9rj4J55
28205E88o6nk44K40Mm2K8m7P6m3K4M2j32NM7R4q4P0j36nJ65q0M2p5j0rR9O6j56P6n2q0
$$ plain form
28642 400 503 517 503 442 550 612 480 428 532 574 546 362 400 536 532 503 409 532 480 522 532 470 470 362 541 517 522 654 438
29038 438 527 489 428 494 522 485 550 456 565 527 461 503 414 513 508 541 438 470 508 475 565 579 423 447 452 494 565 466 442 499 452 635
29475 635 527 442 428 461 489 494 555 461 438 433 517 555 513 480 419 546 513 569 597 527 442 442 522 616 565 367 494 503 494 574 513 513 461
29926 461 438 480 602 536 461 452 470 503 513 560 447 456 466 541 513 423 414 522 494 532 597 541 522 367 489 470 593 513 447 494 400
30349 400 588 593 546 433 480 475 494 442 579 499 400 438 560 536 419 395 513 499 508 560 475 419 428 546 475 546 470 452 423 546
30759 546 597 517 386 405 555 532 583 480 475 320 550 583 579 503 433 438 461 607 630 362 503 503 409 456 499 517 428 475 565 550
31169 550 517 485 433 438 574 588 461 442 470 428 452 579 555 485 423 470 503 579 517 423 414 489 546 532 499 480 527 470 480 579 532 546
31606 546 461 390 560 569 442 466 452 503 503 541 517 517 456 438 546 489 574 414 485 433 536 470 527 447 390 405 541 565 583 485 494
$$ packed form
28642D00J03J4j4o1J08O2j32n2J04M2k8j84L8J36mk9r4J23n2M2J0o2%j08J79k4NJ32k16
29038D38Q9l8o1O6K8l7O5r4J09l8o6M2q9R9nL3j03L2L8l3R0J4j56K4NM2P1r9k4N7m7J83
29475F35j08q5j4L3K8NO1r4k3nQ4L8m2l3o1J27l3N6K8p0q5%Q0R4n1j98J27RrQ0o1%n2
29926D61k3M2J22o6p5rJ8L3J0M7j13RJ0P5k8r0rJ08k8L8O5n6j9j55J22j9J23q0o6M7r4
30349D00J88Nm7j13M7nJ9n2J37q0r9L8J22k4j17k4J18j4RN2q5n6RJ18p1P1p6j8k9J23
30759E46N1q0j31J9J50k3N1j03nj55K30L3mp6p0NK3J46K3k68J41%r4M7M3J8q9M7R0j5
31169E50l3l2n2NJ36J4j27j9K8m2K4J27k4p0o2M7L3P6o2r4rP5N7j4l3j9M7n7J0R9m7J4
31606E46q5p1J70Rj27K4j4N1%L8k4%o1j8J08n7Q5j60P1n2J03o6N7q0n7J5J36K4J8r8R
$$ plain form
32029 494 390 527 602 414 508 409 527 466 522 452 409 522 522 522 485 499 522 489 390 532 489 527 583 414 423 550 560 503 353
32426 353 390 635 593 503 386 428 532 447 588 555 362 508 499 517 541 475 503 513 372 461 400 513 461 447 513
$$ packed form
32029D94j04J37P5j88R4r9J18o1N6p0m3J13%Tl7J4K3l3r9J42m3L8N6j69RJ27J0n7j50
32426C53L7K45m2r0j17M2J04q5J41l3j93J46rJ8K4o6K8J0j41Q9o1J13n2j4O6
32767E13
##END=
